{"text_format":"2","workbook":"xlsx","n_sheets":13,"sheets":["Global Info","Segments","Vertices","Vertices PivotTable","Edges","Do Not Delete","Family Distribution","TR Distribution","Profiles and Themes","Groups","Group Vertices","Overall Metrics","Misc"],"not_rendered":{"charts":9,"images":7,"macros":1,"external_links":0,"defined_names":21,"comments":7,"pivot_tables":1},"unopened":[],"bounds":{"document_bytes":16777216,"sheet_cells":100000,"run_cost":"one","rows_first":2000,"rows_last":500,"rows_between":2000,"halvings":0,"cell_chars":16384,"cell_head_chars":4096},"cells_cut":0,"cells_raw":0,"read":"whole","date_system":"1900"}

{"sheet":"Global Info","index":0,"n_rows":14,"n_cols":9,"rows_kept":14,"cut":false,"hidden":false,"merged":[[13,7,38,8],[3,8,10,8]]}
["Bar No.","Beats per bar",null,"Section","Subsection","Bar"]
[0,4,null,"Exposition","1st subject",0.75]
[152,4,null,null,"Bridge",8.75]
[{"$nulls":4},"2nd subject",20.75,null,null,"To hide the graph pane:"]
[{"$nulls":4},"Codetta",33]
[null,null,null,"Development","1st subject",48.75]
[{"$nulls":4},"2nd subject",55.75]
[{"$nulls":4},"Retransition",81]
[null,null,null,"Recapitulation","1st subject",101]
[{"$nulls":4},"Bridge",108.75]
[{"$nulls":4},"2nd subject",119.75]
[{"$nulls":4},"Codetta",132]
[]
[{"$nulls":7},"To show subgraphs:"]

{"sheet":"Segments","index":1,"n_rows":128,"n_cols":30,"rows_kept":128,"cut":false,"hidden":false,"merged":[]}
["Label","Parents","Successors","Bar","[Pitches]-[Time-points]"]
[{"$f":"IF(D2<10,\"00\",IF(D2<100,\"0\",\"\"))&D2&\"|\"&E2","v":"000|C4"},null,null,0,"C4","F4","Ab4","C5","F5","Ab5","G5","F5","E5","F5","-",3,4,5,6,7,8,9.5,{"$f":"58/6","v":9.6666666666666661},{"$f":"59/6","v":9.8333333333333339},10,12]
[{"$f":"IF(D3<10,\"00\",IF(D3<100,\"0\",\"\"))&D3&\"|\"&E3","v":"003|G4"},"000|C4",null,3,"G4","C5","E5","G5","Bb5","Ab5","G5","F5","G5","-",0,1,2,3,4,5.5,{"$f":"34/6","v":5.666666666666667},{"$f":"35/6","v":5.833333333333333},6,7.5]
[{"$f":"IF(D4<10,\"00\",IF(D4<100,\"0\",\"\"))&D4&\"|\"&E4","v":"004|C5"},"000|C4",null,4,"C5","Ab5","G5","F5","E5","F5","-",3.5,4,5.5,{"$f":"34/6","v":5.666666666666667},{"$f":"35/6","v":5.833333333333333},6,7.5]
[{"$f":"IF(D5<10,\"00\",IF(D5<100,\"0\",\"\"))&D5&\"|\"&E5","v":"005|C5"},"004|C5,003|G4",null,5,"C5","Bb5","Ab5","G5","F5","G5","-",3.5,4,5.5,{"$f":"34/6","v":5.666666666666667},{"$f":"35/6","v":5.833333333333333},6,8]
[{"$f":"IF(D6<10,\"00\",IF(D6<100,\"0\",\"\"))&D6&\"|\"&E6","v":"007|C6"},"005|C5",null,7,"C6","Bb5","Ab5","G5","F5","E5","F5","G5","F5","E5","-",0,2,2.5,3,3.5,4,{"$f":"25/6","v":4.166666666666667},{"$f":"26/6","v":4.333333333333333},4.5,5,7]
[{"$f":"IF(D7<10,\"00\",IF(D7<100,\"0\",\"\"))&D7&\"|\"&E7","v":"008|G2"},"000|C4",null,8,"G2","C3","Eb3","G3","C4","Eb4","D4","C4","B3","C4","C4","C4","-",3,4,5,6,7,8,9.5,{"$f":"58/6","v":9.6666666666666661},{"$f":"59/6","v":9.8333333333333339},10,11,12,16]
[{"$f":"IF(D8<10,\"00\",IF(D8<100,\"0\",\"\"))&D8&\"|\"&E8","v":"011|Eb5"},"008|G2",null,11,"Eb5","Db5","C5","Db5","Db5","Db5","-",1.5,{"$f":"10/6","v":1.6666666666666667},{"$f":"11/6","v":1.8333333333333333},2,3,4,9.5]
[{"$f":"IF(D9<10,\"00\",IF(D9<100,\"0\",\"\"))&D9&\"|\"&E9","v":"012|Bb4"},"011|Eb5",null,12,"Bb4","Ab4","G4","Ab4","Ab4","G4","-",1.5,{"$f":"10/6","v":1.6666666666666667},{"$f":"11/6","v":1.8333333333333333},2,3,4,8]
[{"$f":"IF(D10<10,\"00\",IF(D10<100,\"0\",\"\"))&D10&\"|\"&E10","v":"013|Eb5"},"011|Eb5",null,13,"Eb5","Db5","C5","Db5","Db5","-",1.5,{"$f":"10/6","v":1.6666666666666667},{"$f":"11/6","v":1.8333333333333333},2,3,4]
[{"$f":"IF(D11<10,\"00\",IF(D11<100,\"0\",\"\"))&D11&\"|\"&E11","v":"014|Db5"},"013|Eb5","015|C5",14,"Db5","C5","B4","C5","C5","C5","-",1.5,{"$f":"10/6","v":1.6666666666666667},{"$f":"11/6","v":1.8333333333333333},2,3,4,5]
[{"$f":"IF(D12<10,\"00\",IF(D12<100,\"0\",\"\"))&D12&\"|\"&E12","v":"015|C5"},null,null,15,"C5","Bb4","Ab4","G4","-",0,1,3,4,5]
[{"$f":"IF(D13<10,\"00\",IF(D13<100,\"0\",\"\"))&D13&\"|\"&E13","v":"016|Eb5"},"015|C5",null,16,"Eb5","Db5","C5","Bb4","Ab4","G4","-",1,2,3,5,7,8,9]
[{"$f":"IF(D14<10,\"00\",IF(D14<100,\"0\",\"\"))&D14&\"|\"&E14","v":"018|Eb5"},"016|Eb5",null,18,"Eb5","Db5","C5","Bb4","Ab4","G4","-",1,2,3,5,7,8,9]
[{"$f":"IF(D15<10,\"00\",IF(D15<100,\"0\",\"\"))&D15&\"|\"&E15","v":"020|Fb5"},"000|C4",null,20,"Fb5","Eb5","Db5","Bb4","G4","Fb4","Eb4","Ab4","-",3,4,5,6,7,8,9.5,10,11]
[{"$f":"IF(D16<10,\"00\",IF(D16<100,\"0\",\"\"))&D16&\"|\"&E16","v":"022|Fb5"},"020|Fb5",null,22,"Fb5","Eb5","Db5","Bb4","G4","Fb4","Eb4","Ab4","-",3,4,5,6,7,8,9.5,10,11]
[{"$f":"IF(D17<10,\"00\",IF(D17<100,\"0\",\"\"))&D17&\"|\"&E17","v":"024|Fb5"},"022|Fb5",null,24,"Fb5","Eb5","Db5","Bb4","G4","-",3,4,5,6,7,8]
[{"$f":"IF(D18<10,\"00\",IF(D18<100,\"0\",\"\"))&D18&\"|\"&E18","v":"026|A4"},"026|G4",null,26,"A4","C5","Bb4","-",2.5,3,3.5,4]
[{"$f":"IF(D19<10,\"00\",IF(D19<100,\"0\",\"\"))&D19&\"|\"&E19","v":"026|G4"},"022|Fb5",null,26,"G4","Bb4","Ab4","-",0.5,1,1.5,2]
[{"$f":"IF(D20<10,\"00\",IF(D20<100,\"0\",\"\"))&D20&\"|\"&E20","v":"027|B4"},"026|A4",null,27,"B4","Db5","C5","-",0.5,1,1.5,2]
[{"$f":"IF(D21<10,\"00\",IF(D21<100,\"0\",\"\"))&D21&\"|\"&E21","v":"027|D5"},"027|B4",null,27,"D5","Ab5","D5","Eb5","-",2.5,3,3.5,4,5]
[{"$f":"IF(D22<10,\"00\",IF(D22<100,\"0\",\"\"))&D22&\"|\"&E22","v":"028|D5"},"027|D5",null,28,"D5","Ab5","D5","Eb5","-",2.5,3,3.5,4,5]
[{"$f":"IF(D23<10,\"00\",IF(D23<100,\"0\",\"\"))&D23&\"|\"&E23","v":"029|G5"},"028|D5",null,29,"G5","Fb6","G5","Ab5","-",2.5,3,3.5,4,5]
[{"$f":"IF(D24<10,\"00\",IF(D24<100,\"0\",\"\"))&D24&\"|\"&E24","v":"030|G5"},"029|G5",null,30,"G5","Fb6","G5","-",2.5,3,3.5,4]
[{"$f":"IF(D25<10,\"00\",IF(D25<100,\"0\",\"\"))&D25&\"|\"&E25","v":"031|A5"},"026|A4",null,31,"A5","C6","Bb5","-",2.5,3,3.5,4]
[{"$f":"IF(D26<10,\"00\",IF(D26<100,\"0\",\"\"))&D26&\"|\"&E26","v":"031|G5"},"026|G4",null,31,"G5","Bb5","Ab5","-",0.5,1,1.5,2]
[{"$f":"IF(D27<10,\"00\",IF(D27<100,\"0\",\"\"))&D27&\"|\"&E27","v":"032|B5"},"027|B4",null,32,"B5","Db6","C6","-",0.5,1,1.5,2]
[{"$f":"IF(D28<10,\"00\",IF(D28<100,\"0\",\"\"))&D28&\"|\"&E28","v":"032|C6"},"032|B5","033|D6",32,"C6","Eb6","Db6","-",2.5,3,3.5,4]
[{"$f":"IF(D29<10,\"00\",IF(D29<100,\"0\",\"\"))&D29&\"|\"&E29","v":"033|C3"},"000|C4",null,33,"C3","Eb3","Ab3","-",0,1,3,4]
[{"$f":"IF(D30<10,\"00\",IF(D30<100,\"0\",\"\"))&D30&\"|\"&E30","v":"033|D6"},"032|C6",null,33,"D6","F6","Eb6","Db6","C6","Bb5","Ab5","G5","-",0.5,1,1.5,2,2.5,3,3.5,4,4.5]
[{"$f":"IF(D31<10,\"00\",IF(D31<100,\"0\",\"\"))&D31&\"|\"&E31","v":"034|Db3"},"033|C3",null,34,"Db3","F3","Bb3","-",0,1,3,4]
[{"$f":"IF(D32<10,\"00\",IF(D32<100,\"0\",\"\"))&D32&\"|\"&E32","v":"035|C4"},"020|Fb5",null,35,"C4","Db4","Bb3","G3","Db3","-",3,4,5,6,7,8]
[{"$f":"IF(D33<10,\"00\",IF(D33<100,\"0\",\"\"))&D33&\"|\"&E33","v":"035|Eb3"},"034|Db3","035|C4",35,"Eb3","Ab3","C4","-",0,1,3,4]
[{"$f":"IF(D34<10,\"00\",IF(D34<100,\"0\",\"\"))&D34&\"|\"&E34","v":"037|Ab5"},"033|D6",null,37,"Ab5","F6","Eb6","Db6","C6","Bb5","Ab5","G5","-",0.5,1,1.5,2,2.5,3,3.5,4,4.5]
[{"$f":"IF(D35<10,\"00\",IF(D35<100,\"0\",\"\"))&D35&\"|\"&E35","v":"037|C2"},"033|C3",null,37,"C2","Eb2","Ab2","-",0,1,3,4]
[{"$f":"IF(D36<10,\"00\",IF(D36<100,\"0\",\"\"))&D36&\"|\"&E36","v":"038|Db2"},"034|Db3",null,38,"Db2","F2","Bb2","-",0,1,3,4]
[{"$f":"IF(D37<10,\"00\",IF(D37<100,\"0\",\"\"))&D37&\"|\"&E37","v":"039|C3"},"035|C4",null,39,"C3","Db3","Bb2","G2","Eb2","Ab2","-",3,4,5,6,7,8,9]
[{"$f":"IF(D38<10,\"00\",IF(D38<100,\"0\",\"\"))&D38&\"|\"&E38","v":"039|Eb2"},"035|Eb3","039|C3",39,"Eb2","Ab2","C3","-",0,1,3,4]
[{"$f":"IF(D39<10,\"00\",IF(D39<100,\"0\",\"\"))&D39&\"|\"&E39","v":"041|D4"},"020|Fb5",null,41,"D4","Cb5","Bb4","Ab4","-",1.5,2,3.5,4,6]
[{"$f":"IF(D40<10,\"00\",IF(D40<100,\"0\",\"\"))&D40&\"|\"&E40","v":"042|G4"},null,null,42,"G4","Eb5","Eb5","Ab4","-",2,3.5,4,5,5.5]
[{"$f":"IF(D41<10,\"00\",IF(D41<100,\"0\",\"\"))&D41&\"|\"&E41","v":"043|D4"},"041|D4",null,43,"D4","Cb5","Bb4","Ab4","-",1.5,2,3.5,4,6]
[{"$f":"IF(D42<10,\"00\",IF(D42<100,\"0\",\"\"))&D42&\"|\"&E42","v":"044|G4"},"042|G4",null,44,"G4","Eb5","Eb5","Ab4","-",2,3.5,4,5,5.5]
[{"$f":"IF(D43<10,\"00\",IF(D43<100,\"0\",\"\"))&D43&\"|\"&E43","v":"045|D5"},"043|D4",null,45,"D5","Cb6","Bb5","Ab5","-",1.5,2,3.5,4,6]
[{"$f":"IF(D44<10,\"00\",IF(D44<100,\"0\",\"\"))&D44&\"|\"&E44","v":"046|G5"},"044|G4",null,46,"G5","Eb6","Eb6","Ab5","-",2,3.5,4,8,11]
[{"$f":"IF(D45<10,\"00\",IF(D45<100,\"0\",\"\"))&D45&\"|\"&E45","v":"048|Eb4"},"000|C4",null,48,"Eb4","Ab4","C5","Eb5","Ab5","C6","Bb5","Ab5","G5","Ab5","-",3,4,5,6,7,8,9.5,{"$f":"58/6","v":9.6666666666666661},{"$f":"59/6","v":9.8333333333333339},10,11.5]
[{"$f":"IF(D46<10,\"00\",IF(D46<100,\"0\",\"\"))&D46&\"|\"&E46","v":"050|Db5"},"005|C5",null,50,"Db5","Db6","C6","Bb5","A5","Bb5","-",3.5,4,5.5,{"$f":"34/6","v":5.666666666666667},{"$f":"35/6","v":5.833333333333333},6,8]
[{"$f":"IF(D47<10,\"00\",IF(D47<100,\"0\",\"\"))&D47&\"|\"&E47","v":"052|Bb4"},"003|G4",null,52,"Bb4","Db5","G5","Bb5","Db5","Db6","C6","Bb5","A5","Bb5","-",0,1,2,3,3.5,4,5.5,{"$f":"34/6","v":5.666666666666667},{"$f":"35/6","v":5.833333333333333},6,7.5]
[{"$f":"IF(D48<10,\"00\",IF(D48<100,\"0\",\"\"))&D48&\"|\"&E48","v":"053|Db5"},"050|Db5",null,53,"Db5","Db6","C6","Bb5","A5","Bb5","A5","-",3.5,4,5.5,{"$f":"34/6","v":5.666666666666667},{"$f":"35/6","v":5.833333333333333},6,8,9]
[{"$f":"IF(D49<10,\"00\",IF(D49<100,\"0\",\"\"))&D49&\"|\"&E49","v":"055|Gb5"},"020|Fb5",null,55,"Gb5","F5","Eb5","C5","A4","Gb4","F4","Bb4","-",3,4,5,6,7,8,9.5,10,11]
[{"$f":"IF(D50<10,\"00\",IF(D50<100,\"0\",\"\"))&D50&\"|\"&E50","v":"057|Gb5"},"022|Fb5",null,57,"Gb5","F5","Eb5","C5","A4","Gb4","F4","Bb4","-",3,4,5,6,7,8,9.5,10,11]
[{"$f":"IF(D51<10,\"00\",IF(D51<100,\"0\",\"\"))&D51&\"|\"&E51","v":"059|Gb5"},"024|Fb5",null,59,"Gb5","F5","Eb5","C5","A4","-",3,4,5,6,7,8]
[{"$f":"IF(D52<10,\"00\",IF(D52<100,\"0\",\"\"))&D52&\"|\"&E52","v":"061|A4"},"026|G4",null,61,"A4","C5","Bb4","-",0.5,1,1.5,2]
[{"$f":"IF(D53<10,\"00\",IF(D53<100,\"0\",\"\"))&D53&\"|\"&E53","v":"061|Bb4"},"026|A4",null,61,"Bb4","Db5","C5","-",2.5,3,3.5,4]
[{"$f":"IF(D54<10,\"00\",IF(D54<100,\"0\",\"\"))&D54&\"|\"&E54","v":"062|B4"},"027|D5",null,62,"B4","Db5","C5","B4","-",2.5,3,3.5,4,5]
[{"$f":"IF(D55<10,\"00\",IF(D55<100,\"0\",\"\"))&D55&\"|\"&E55","v":"062|C5"},"027|B4",null,62,"C5","Eb5","Db5","-",0.5,1,1.5,2]
[{"$f":"IF(D56<10,\"00\",IF(D56<100,\"0\",\"\"))&D56&\"|\"&E56","v":"063|Ab5"},"055|Gb5",null,63,"Ab5","G5","F5","D5","B4","Ab4","G4","C5","-",3,4,5,6,7,8,9.5,10,11]
[{"$f":"IF(D57<10,\"00\",IF(D57<100,\"0\",\"\"))&D57&\"|\"&E57","v":"065|Ab5"},"057|Gb5",null,65,"Ab5","G5","F5","D5","B4","Ab4","G4","C5","-",3,4,5,6,7,8,9.5,10,11]
[{"$f":"IF(D58<10,\"00\",IF(D58<100,\"0\",\"\"))&D58&\"|\"&E58","v":"067|Ab3"},"065|Ab5",null,67,"Ab3","G3","F3","D3","B2","Ab2","G2","C3","-",3,4,5,6,7,8,9.5,10,11]
[{"$f":"IF(D59<10,\"00\",IF(D59<100,\"0\",\"\"))&D59&\"|\"&E59","v":"069|B4"},null,null,69,"B4","C5","-",1,2,3]
[{"$f":"IF(D60<10,\"00\",IF(D60<100,\"0\",\"\"))&D60&\"|\"&E60","v":"069|Gb3"},"067|Ab3",null,69,"Gb3","F3","Eb3","C3","A2","Gb2","F2","Bb2","-",3,4,5,6,7,8,9.5,10,11]
[{"$f":"IF(D61<10,\"00\",IF(D61<100,\"0\",\"\"))&D61&\"|\"&E61","v":"071|A4"},"069|B4",null,71,"A4","Bb4","-",1,2,3]
[{"$f":"IF(D62<10,\"00\",IF(D62<100,\"0\",\"\"))&D62&\"|\"&E62","v":"071|Fb3"},"069|Gb3",null,71,"Fb3","Eb3","Db3","Bb2","G2","Fb2","Eb2","-",3,4,5,6,7,8,9,11]
[{"$f":"IF(D63<10,\"00\",IF(D63<100,\"0\",\"\"))&D63&\"|\"&E63","v":"073|G4"},"071|A4",null,73,"G4","Ab4","-",2,6,8]
[{"$f":"IF(D64<10,\"00\",IF(D64<100,\"0\",\"\"))&D64&\"|\"&E64","v":"075|F4"},"073|G4",null,75,"F4","G4","-",2,6,8]
[{"$f":"IF(D65<10,\"00\",IF(D65<100,\"0\",\"\"))&D65&\"|\"&E65","v":"077|E4"},"075|F4",null,77,"E4","F4","-",2,6,8]
[{"$f":"IF(D66<10,\"00\",IF(D66<100,\"0\",\"\"))&D66&\"|\"&E66","v":"081|C5"},null,null,81,"C5","Ab4","-",3,4,5]
[{"$f":"IF(D67<10,\"00\",IF(D67<100,\"0\",\"\"))&D67&\"|\"&E67","v":"082|F5"},"081|C5",null,82,"F5","E5","-",3,4,5]
[{"$f":"IF(D68<10,\"00\",IF(D68<100,\"0\",\"\"))&D68&\"|\"&E68","v":"083|C6"},"082|F5",null,83,"C6","F5","-",3,4,5]
[{"$f":"IF(D69<10,\"00\",IF(D69<100,\"0\",\"\"))&D69&\"|\"&E69","v":"084|F6"},"083|C6",null,84,"F6","E6","-",2,4,5]
[{"$f":"IF(D70<10,\"00\",IF(D70<100,\"0\",\"\"))&D70&\"|\"&E70","v":"085|C5"},"081|C5",null,85,"C5","Ab4","Ab4","-",3,4,5,6]
[{"$f":"IF(D71<10,\"00\",IF(D71<100,\"0\",\"\"))&D71&\"|\"&E71","v":"086|F5"},"082|F5",null,86,"F5","E5","E5","-",3,4,5,6]
[{"$f":"IF(D72<10,\"00\",IF(D72<100,\"0\",\"\"))&D72&\"|\"&E72","v":"087|C6"},"083|C6",null,87,"C6","F5","F5","-",3,4,5,6]
[{"$f":"IF(D73<10,\"00\",IF(D73<100,\"0\",\"\"))&D73&\"|\"&E73","v":"088|F6"},"084|F6",null,88,"F6","E6","E6","-",3,4,5,6]
[{"$f":"IF(D74<10,\"00\",IF(D74<100,\"0\",\"\"))&D74&\"|\"&E74","v":"089|Db6"},"088|F6",null,89,"Db6","C6","C6","-",3,4,5,6]
[{"$f":"IF(D75<10,\"00\",IF(D75<100,\"0\",\"\"))&D75&\"|\"&E75","v":"090|F6"},"088|F6",null,90,"F6","E6","E6","-",3,4,5,6]
[{"$f":"IF(D76<10,\"00\",IF(D76<100,\"0\",\"\"))&D76&\"|\"&E76","v":"091|Db6"},"089|Db6",null,91,"Db6","C6","C6","-",3,4,5,6]
[{"$f":"IF(D77<10,\"00\",IF(D77<100,\"0\",\"\"))&D77&\"|\"&E77","v":"092|F6"},"090|F6",null,92,"F6","E6","-",3,4,5]
[{"$f":"IF(D78<10,\"00\",IF(D78<100,\"0\",\"\"))&D78&\"|\"&E78","v":"095|Ab4"},"000|C4",null,95,"Ab4","Gb4","F4","Gb4","-",1.5,{"$f":"10/6","v":1.6666666666666667},{"$f":"11/6","v":1.8333333333333333},2,3]
[{"$f":"IF(D79<10,\"00\",IF(D79<100,\"0\",\"\"))&D79&\"|\"&E79","v":"096|Eb6"},"095|Ab4",null,96,"Eb6","Db6","C6","Db6","-",1.5,{"$f":"10/6","v":1.6666666666666667},{"$f":"11/6","v":1.8333333333333333},2,3]
["097|F4","095|Ab4",null,97,"F4","E4","D4","E4","-",1.5,1.6666666666666667,1.8333333333333333,2,3]
[{"$f":"IF(D81<10,\"00\",IF(D81<100,\"0\",\"\"))&D81&\"|\"&E81","v":"098|Db6"},"096|Eb6",null,98,"Db6","C6","B5","C6","-",1.5,{"$f":"10/6","v":1.6666666666666667},{"$f":"11/6","v":1.8333333333333333},2,3]
["099|Eb4","097|F4",null,99,"Eb4","D4","C4","D4","-",1.5,1.6666666666666667,1.8333333333333333,2,3]
[{"$f":"IF(D83<10,\"00\",IF(D83<100,\"0\",\"\"))&D83&\"|\"&E83","v":"100|C6"},"098|Db6",null,100,"C6","Bb5","A5","Bb5","-",1.5,{"$f":"10/6","v":1.6666666666666667},{"$f":"11/6","v":1.8333333333333333},2,3]
["101|F4","000|C4",null,101,"F4","Ab4","C5","F5","Ab5","G5","F5","E5","F5","-",0,1,2,3,4,5.5,5.666666666666667,5.833333333333333,6,8]
[{"$f":"IF(D85<10,\"00\",IF(D85<100,\"0\",\"\"))&D85&\"|\"&E85","v":"103|G4"},"003|G4",null,103,"G4","C5","E5","G5","Bb5","Ab5","G5","F5","G5","-",0,1,2,3,4,5.5,{"$f":"34/6","v":5.666666666666667},{"$f":"35/6","v":5.833333333333333},6,7.5]
[{"$f":"IF(D86<10,\"00\",IF(D86<100,\"0\",\"\"))&D86&\"|\"&E86","v":"104|C5"},"004|C5",null,104,"C5","Ab5","G5","F5","E5","F5","-",3.5,4,5.5,{"$f":"34/6","v":5.666666666666667},{"$f":"35/6","v":5.833333333333333},6,7.5]
[{"$f":"IF(D87<10,\"00\",IF(D87<100,\"0\",\"\"))&D87&\"|\"&E87","v":"105|C5"},"005|C5",null,105,"C5","Bb5","Ab5","G5","F5","G5","-",3.5,4,5.5,{"$f":"34/6","v":5.666666666666667},{"$f":"35/6","v":5.833333333333333},6,8]
[{"$f":"IF(D88<10,\"00\",IF(D88<100,\"0\",\"\"))&D88&\"|\"&E88","v":"107|C6"},"007|C6",null,107,"C6","Bb5","Ab5","G5","F5","E5","F5","G5","F5","E5","-",0,2,2.5,3,3.5,4,{"$f":"25/6","v":4.166666666666667},{"$f":"26/6","v":4.333333333333333},4.5,5,7]
[{"$f":"IF(D89<10,\"00\",IF(D89<100,\"0\",\"\"))&D89&\"|\"&E89","v":"108|C3"},"008|G2",null,108,"C3","F3","Ab3","C4","F4","Ab4","G4","F4","E4","F4","F4","F4","-",3,4,5,6,7,8,9.5,{"$f":"58/6","v":9.6666666666666661},{"$f":"59/6","v":9.8333333333333339},10,11,12,16]
[{"$f":"IF(D90<10,\"00\",IF(D90<100,\"0\",\"\"))&D90&\"|\"&E90","v":"111|Bb5"},"011|Eb5",null,111,"Bb5","Ab5","Gb5","F5","Gb5","Gb5","Gb5","-",0,1.5,{"$f":"10/6","v":1.6666666666666667},{"$f":"11/6","v":1.8333333333333333},2,3,4,9.5]
[{"$f":"IF(D91<10,\"00\",IF(D91<100,\"0\",\"\"))&D91&\"|\"&E91","v":"112|Db5"},"012|Bb4,111|Bb5",null,112,"Db5","C5","B4","C5","C5","C5","-",1.5,{"$f":"10/6","v":1.6666666666666667},{"$f":"11/6","v":1.8333333333333333},2,3,4,9.5]
[{"$f":"IF(D92<10,\"00\",IF(D92<100,\"0\",\"\"))&D92&\"|\"&E92","v":"113|Gb5"},"013|Eb5,111|Bb5",null,113,"Gb5","F5","E5","F5","F5","F5","-",1.5,{"$f":"10/6","v":1.6666666666666667},{"$f":"11/6","v":1.8333333333333333},2,3,4,8]
[{"$f":"IF(D93<10,\"00\",IF(D93<100,\"0\",\"\"))&D93&\"|\"&E93","v":"114|C5"},"113|Gb5,112|Db5",null,114,"C5","Bb4","A4","Bb4","Bb4","B4","-",1.5,{"$f":"10/6","v":1.6666666666666667},{"$f":"11/6","v":1.8333333333333333},2,3,4,8]
[{"$f":"IF(D94<10,\"00\",IF(D94<100,\"0\",\"\"))&D94&\"|\"&E94","v":"115|G5"},"114|C5",null,115,"G5","F5","E5","F5","G5","Ab5","E5","F5","B4","C5","-",1.5,{"$f":"10/6","v":1.6666666666666667},{"$f":"11/6","v":1.8333333333333333},2,3,4,5,6,7,8,9]
[{"$f":"IF(D95<10,\"00\",IF(D95<100,\"0\",\"\"))&D95&\"|\"&E95","v":"117|E5"},"115|G5",null,117,"E5","F5","G5","Ab5","E5","F5","B4","C5","-",1,2,3,4,5,6,7,8,9]
[{"$f":"IF(D96<10,\"00\",IF(D96<100,\"0\",\"\"))&D96&\"|\"&E96","v":"119|Db5"},"020|Fb5",null,119,"Db5","C5","Bb4","G4","E4","Db4","C4","F4","-",3,4,5,6,7,8,9.5,10,11]
[{"$f":"IF(D97<10,\"00\",IF(D97<100,\"0\",\"\"))&D97&\"|\"&E97","v":"121|Db6"},"022|Fb5",null,121,"Db6","C6","Bb5","G5","E5","Db5","C5","F5","-",3,4,5,6,7,8,9.5,10,11]
[{"$f":"IF(D98<10,\"00\",IF(D98<100,\"0\",\"\"))&D98&\"|\"&E98","v":"123|Db6"},"024|Fb5",null,123,"Db6","C6","Bb5","G5","E5","-",3,4,5,6,7,8]
[{"$f":"IF(D99<10,\"00\",IF(D99<100,\"0\",\"\"))&D99&\"|\"&E99","v":"125|E5"},"026|G4",null,125,"E5","G5","F5","-",0.5,1,1.5,2]
[{"$f":"IF(D100<10,\"00\",IF(D100<100,\"0\",\"\"))&D100&\"|\"&E100","v":"125|F5"},"026|A4",null,125,"F5","Ab5","G5","-",2.5,3,3.5,4]
[{"$f":"IF(D101<10,\"00\",IF(D101<100,\"0\",\"\"))&D101&\"|\"&E101","v":"126|B5"},"027|D5",null,126,"B5","F6","B5","C6","-",2.5,3,3.5,4,5]
[{"$f":"IF(D102<10,\"00\",IF(D102<100,\"0\",\"\"))&D102&\"|\"&E102","v":"126|G5"},"027|B4",null,126,"G5","Bb5","Ab5","-",0.5,1,1.5,2]
[{"$f":"IF(D103<10,\"00\",IF(D103<100,\"0\",\"\"))&D103&\"|\"&E103","v":"127|B5"},"028|D5",null,127,"B5","F6","B5","C6","-",2.5,3,3.5,4,5]
[{"$f":"IF(D104<10,\"00\",IF(D104<100,\"0\",\"\"))&D104&\"|\"&E104","v":"128|E5"},"029|G5",null,128,"E5","Db6","E5","F5","-",2.5,3,3.5,4,5]
[{"$f":"IF(D105<10,\"00\",IF(D105<100,\"0\",\"\"))&D105&\"|\"&E105","v":"129|E5"},"030|G5",null,129,"E5","Db6","E5","-",2.5,3,3.5,4]
[{"$f":"IF(D106<10,\"00\",IF(D106<100,\"0\",\"\"))&D106&\"|\"&E106","v":"130|E5"},"031|G5",null,130,"E5","G5","F5","-",0.5,1,1.5,2]
[{"$f":"IF(D107<10,\"00\",IF(D107<100,\"0\",\"\"))&D107&\"|\"&E107","v":"130|F5"},"031|A5",null,130,"F5","Ab5","G5","-",2.5,3,3.5,4]
[{"$f":"IF(D108<10,\"00\",IF(D108<100,\"0\",\"\"))&D108&\"|\"&E108","v":"131|A5"},"032|C6","132|C6",131,"A5","C6","Bb5","-",2.5,3,3.5,4]
[{"$f":"IF(D109<10,\"00\",IF(D109<100,\"0\",\"\"))&D109&\"|\"&E109","v":"131|G5"},"032|B5",null,131,"G5","Bb5","Ab5","-",0.5,1,1.5,2]
[{"$f":"IF(D110<10,\"00\",IF(D110<100,\"0\",\"\"))&D110&\"|\"&E110","v":"132|Ab2"},"033|C3",null,132,"Ab2","C3","F3","-",0,1,3,4]
[{"$f":"IF(D111<10,\"00\",IF(D111<100,\"0\",\"\"))&D111&\"|\"&E111","v":"132|C6"},"033|D6",null,132,"C6","F6","Eb6","Db6","C6","Bb5","Ab5","G5","-",0.5,1,1.5,2,2.5,3,3.5,4,4.5]
[{"$f":"IF(D112<10,\"00\",IF(D112<100,\"0\",\"\"))&D112&\"|\"&E112","v":"133|Bb2"},"034|Db3",null,133,"Bb2","Db3","G3","-",0,1,3,4]
[{"$f":"IF(D113<10,\"00\",IF(D113<100,\"0\",\"\"))&D113&\"|\"&E113","v":"134|Ab3"},"035|C4",null,134,"Ab3","Bb3","G3","E3","Bb2","-",3,4,5,6,7,8]
[{"$f":"IF(D114<10,\"00\",IF(D114<100,\"0\",\"\"))&D114&\"|\"&E114","v":"134|C3"},"035|Eb3","134|Ab3",134,"C3","F3","Ab3","-",0,1,3,4]
[{"$f":"IF(D115<10,\"00\",IF(D115<100,\"0\",\"\"))&D115&\"|\"&E115","v":"136|Ab2"},"037|C2",null,136,"Ab2","C3","F3","-",0,1,3,4]
[{"$f":"IF(D116<10,\"00\",IF(D116<100,\"0\",\"\"))&D116&\"|\"&E116","v":"136|C6"},"037|Ab5",null,136,"C6","F6","Eb6","Db6","C6","Bb5","Ab5","G5","-",0.5,1,1.5,2,2.5,3,3.5,4,4.5]
[{"$f":"IF(D117<10,\"00\",IF(D117<100,\"0\",\"\"))&D117&\"|\"&E117","v":"137|Bb2"},"038|Db2",null,137,"Bb2","Db3","G3","-",0,1,3,4]
[{"$f":"IF(D118<10,\"00\",IF(D118<100,\"0\",\"\"))&D118&\"|\"&E118","v":"138|C3"},"039|Eb2",null,138,"C3","F3","Ab3","-",0,1,3,4]
[{"$f":"IF(D119<10,\"00\",IF(D119<100,\"0\",\"\"))&D119&\"|\"&E119","v":"140|Ab4"},"041|D4",null,140,"Ab4","G4","F4","-",2,3.5,4,6]
[{"$f":"IF(D120<10,\"00\",IF(D120<100,\"0\",\"\"))&D120&\"|\"&E120","v":"141|E4"},"042|G4",null,141,"E4","C5","C5","F4","-",2,3.5,4,5,6]
[{"$f":"IF(D121<10,\"00\",IF(D121<100,\"0\",\"\"))&D121&\"|\"&E121","v":"142|Ab4"},"043|D4",null,142,"Ab4","G4","F4","-",2,3.5,4,6]
[{"$f":"IF(D122<10,\"00\",IF(D122<100,\"0\",\"\"))&D122&\"|\"&E122","v":"143|E4"},"044|G4",null,143,"E4","C5","C5","F4","-",2,3.5,4,5,5.5]
[{"$f":"IF(D123<10,\"00\",IF(D123<100,\"0\",\"\"))&D123&\"|\"&E123","v":"144|B4"},"045|D5",null,144,"B4","Ab5","G5","F5","-",1.5,2,3.5,4,6]
[{"$f":"IF(D124<10,\"00\",IF(D124<100,\"0\",\"\"))&D124&\"|\"&E124","v":"145|E5"},"046|G5",null,145,"E5","C6","C6","F5","-",2,3.5,4,8,9]
[{"$f":"IF(D125<10,\"00\",IF(D125<100,\"0\",\"\"))&D125&\"|\"&E125","v":"147|Bb5"},"145|E5",null,147,"Bb5","Bb5","Eb5","-",3.5,4,8,9]
[{"$f":"IF(D126<10,\"00\",IF(D126<100,\"0\",\"\"))&D126&\"|\"&E126","v":"149|Ab5"},"147|Bb5",null,149,"Ab5","Db5","-",3,4,5]
[{"$f":"IF(D127<10,\"00\",IF(D127<100,\"0\",\"\"))&D127&\"|\"&E127","v":"150|F5"},"150|G5",null,150,"F5","F5","E5","F5","-",3,4,6,8,9]
[{"$f":"IF(D128<10,\"00\",IF(D128<100,\"0\",\"\"))&D128&\"|\"&E128","v":"150|G5"},"149|Ab5",null,150,"G5","C5","-",1,2,3]

{"sheet":"Vertices","index":2,"n_rows":129,"n_cols":36,"rows_kept":129,"cut":false,"hidden":false,"merged":[]}
[null,"Visual Properties",{"$nulls":5},"Labels",null,null,null,"Layout",{"$nulls":5},"Graph Metrics",{"$nulls":8},"Do Not Edit"]
["Vertex","Color","Shape","Size","Opacity","Image File","Visibility","Label","Label Fill Color","Label Position","Tooltip","Layout Order","X","Y","Locked?","Polar R","Polar Angle","Degree","In-Degree","Out-Degree","Betweenness Centrality","Closeness Centrality","Eigenvector Centrality","PageRank","Clustering Coefficient","Reciprocated Vertex Pair Ratio","ID","Dynamic Filter","Type","Strong Component","Role","Family","Type Region","Process","Onset","Offset"]
["000|C4","0, 12, 96",{"$nulls":4},"Show","000|C4",{"$nulls":4},4501.01318359375,5632.48828125,{"$nulls":12},3,null,1.1000000000000001,null,"Source","S1","1.1.1","Ait",0.75,3]
["003|G4","0, 12, 96",{"$nulls":4},"Show","003|G4",{"$nulls":4},4168.689453125,5315.994140625,{"$nulls":12},4,null,1.1000000000000001,null,null,"S1","1.1.1","C",3,4.875]
["004|C5","0, 12, 96",{"$nulls":4},"Show","004|C5",{"$nulls":4},3836.365234375,5315.994140625,{"$nulls":12},5,null,1.1000000000000001,null,null,"S1","1.1.1","C",4.875,5.875]
["005|C5","0, 12, 96",{"$nulls":4},"Show","005|C5",{"$nulls":4},3504.040771484375,4999.5,{"$nulls":12},6,null,1.1000000000000001,null,"WI Epiphany","S1","1.1.1","Ai",5.875,7]
["007|C6","0, 136, 227",{"$nulls":4},"Show","007|C6",{"$nulls":4},3504.040771484375,4683.00537109375,{"$nulls":12},7,null,2.1,null,null,"S1","2.1.1","At",7,8.75]
["008|G2","0, 12, 96",{"$nulls":4},"Show","008|G2",{"$nulls":4},4501.01318359375,5315.994140625,{"$nulls":12},8,null,1.1000000000000001,null,null,"S1","1.1.1","C",8.75,12]
["011|Eb5","0, 12, 96",{"$nulls":4},"Show","011|Eb5",{"$nulls":4},4833.33740234375,4999.5,{"$nulls":12},9,null,1.1000000000000001,null,null,"S1","1.1.1","C",11.375,13.375]
["012|Bb4","0, 12, 96",{"$nulls":4},"Show","012|Bb4",{"$nulls":4},4833.33740234375,4683.00537109375,{"$nulls":12},10,null,1.1000000000000001,null,null,"S1","1.1.1","C",12.375,14]
["013|Eb5","0, 12, 96",{"$nulls":4},"Show","013|Eb5",{"$nulls":4},4168.689453125,4683.00537109375,{"$nulls":12},11,null,1.1000000000000001,null,null,"S1","1.1.1","C",13.375,14]
["014|Db5","0, 12, 96",{"$nulls":4},"Show","014|Db5",{"$nulls":4},3836.365234375,4366.51123046875,{"$nulls":12},12,null,1.1000000000000001,null,null,"S1","1.1.1","",14.375,15.25]
["015|C5","0, 100, 50",{"$nulls":4},"Show","015|C5",{"$nulls":4},3171.716796875,5948.982421875,{"$nulls":12},13,null,1.4,null,"Source","S2","1.4.1","Ait",15,16.25]
["016|Eb5","0, 176, 22",{"$nulls":4},"Show","016|Eb5",{"$nulls":4},3171.716796875,5632.48828125,{"$nulls":12},14,null,1.5,null,null,"S2","1.5.1","At",16.25,18.25]
["018|Eb5","0, 176, 22",{"$nulls":4},"Show","018|Eb5",{"$nulls":4},3171.716796875,5315.994140625,{"$nulls":12},15,null,1.5,null,null,"S2","1.5.1","",18.25,20.25]
["020|Fb5","191, 0, 0",{"$nulls":4},"Show","020|Fb5",{"$nulls":4},6162.6337890625,5315.994140625,{"$nulls":12},16,null,1.6,null,null,"S1","1.6.1","Ait",20.75,22.75]
["022|Fb5","191, 0, 0",{"$nulls":4},"Show","022|Fb5",{"$nulls":4},6162.6337890625,4999.5,{"$nulls":12},17,null,1.6,null,null,"S1","1.6.1","Ai",22.75,24.75]
["024|Fb5","191, 0, 0",{"$nulls":4},"Show","024|Fb5",{"$nulls":4},5497.98583984375,4683.00537109375,{"$nulls":12},18,null,1.6,null,null,"S1","1.6.1","",24.75,26]
["026|G4","230, 120, 0",{"$nulls":4},"Show","026|G4",{"$nulls":4},5830.31005859375,4683.00537109375,{"$nulls":12},19,null,3.1,null,null,"S1","3.1.1","At",26.125,26.5]
["026|A4","230, 120, 0",{"$nulls":4},"Show","026|A4",{"$nulls":4},5830.31005859375,4366.51123046875,{"$nulls":12},20,null,3.1,null,null,"S1","3.1.1","",26.625,27]
["027|B4","230, 120, 0",{"$nulls":4},"Show","027|B4",{"$nulls":4},5497.98583984375,4050.017333984375,{"$nulls":12},21,null,3.1,null,null,"S1","3.1.1","",27.125,27.5]
["027|D5","230, 120, 0",{"$nulls":4},"Show","027|D5",{"$nulls":4},5165.662109375,3733.523193359375,{"$nulls":12},22,null,3.1,null,null,"S1","3.1.1","",27.625,28.25]
["028|D5","230, 120, 0",{"$nulls":4},"Show","028|D5",{"$nulls":4},5165.662109375,3417.02880859375,{"$nulls":12},23,null,3.1,null,null,"S1","3.1.1","",28.625,29.25]
["029|G5","230, 120, 0",{"$nulls":4},"Show","029|G5",{"$nulls":4},4833.33740234375,3100.53466796875,{"$nulls":12},24,null,3.1,null,null,"S1","3.1.1","",29.625,30.25]
["030|G5","230, 120, 0",{"$nulls":4},"Show","030|G5",{"$nulls":4},4833.33740234375,2784.04052734375,{"$nulls":12},25,null,3.1,null,null,"S1","3.1.1","",30.625,31]
["031|G5","230, 120, 0",{"$nulls":4},"Show","031|G5",{"$nulls":4},6162.6337890625,4366.51123046875,{"$nulls":12},26,null,3.1,null,null,"S1","3.1.1","",31.125,31.5]
["031|A5","230, 120, 0",{"$nulls":4},"Show","031|A5",{"$nulls":4},5830.31005859375,4050.017333984375,{"$nulls":12},27,null,3.1,null,null,"S1","3.1.1","",31.625,32]
["032|B5","230, 120, 0",{"$nulls":4},"Show","032|B5",{"$nulls":4},4833.33740234375,3733.523193359375,{"$nulls":12},28,null,3.1,null,null,"S1","3.1.1","",32.125,32.5]
["032|C6","230, 120, 0",{"$nulls":4},"Show","032|C6",{"$nulls":4},4501.01318359375,3417.02880859375,{"$nulls":12},29,null,3.1,null,null,"S1","3.1.1","",32.625,33]
["033|C3","255, 191, 0",{"$nulls":4},"Show","033|C3",{"$nulls":4},8821.2275390625,5315.994140625,{"$nulls":12},30,null,4.0999999999999996,null,null,"S1","4.1.1","At",33,34]
["033|D6","230, 120, 0",{"$nulls":4},"Show","033|D6",{"$nulls":4},4168.689453125,3100.53466796875,{"$nulls":12},31,null,3.1,null,null,"S1","3.1.1","",33.125,34.125]
["034|Db3","255, 191, 0",{"$nulls":4},"Show","034|Db3",{"$nulls":4},9153.5517578125,4999.5,{"$nulls":12},32,null,4.0999999999999996,null,null,"S1","4.1.1","",34,35]
["035|Eb3","255, 191, 0",{"$nulls":4},"Show","035|Eb3",{"$nulls":4},9485.875,4683.00537109375,{"$nulls":12},33,null,4.0999999999999996,null,null,"S1","4.1.1","",35,36]
["035|C4","191, 0, 0",{"$nulls":4},"Show","035|C4",{"$nulls":4},6827.28271484375,4999.5,{"$nulls":12},34,null,1.6,null,null,"S1","1.6.1","Ai",35.75,37]
["037|C2","255, 191, 0",{"$nulls":4},"Show","037|C2",{"$nulls":4},8821.2275390625,4999.5,{"$nulls":12},35,null,4.0999999999999996,null,null,"S1","4.1.1","",37,38]
["037|Ab5","230, 120, 0",{"$nulls":4},"Show","037|Ab5",{"$nulls":4},4168.689453125,2784.04052734375,{"$nulls":12},36,null,3.1,null,null,"S1","3.1.1","",37.125,38.125]
["038|Db2","255, 191, 0",{"$nulls":4},"Show","038|Db2",{"$nulls":4},9153.5517578125,4683.00537109375,{"$nulls":12},37,null,4.0999999999999996,null,null,"S1","4.1.1","",38,39]
["039|Eb2","255, 191, 0",{"$nulls":4},"Show","039|Eb2",{"$nulls":4},9818.2001953125,4366.51123046875,{"$nulls":12},38,null,4.0999999999999996,null,null,"S1","4.1.1","",39,40]
["039|C3","150, 200, 0",{"$nulls":4},"Show","039|C3",{"$nulls":4},7159.6064453125,4683.00537109375,{"$nulls":12},39,null,5.0999999999999996,null,null,"S1","5.1.1","At",39.75,41.25]
["041|D4","200, 0, 120",{"$nulls":4},"Show","041|D4",{"$nulls":4},7159.6064453125,4999.5,{"$nulls":12},40,null,6.1,null,null,"S1","6.1.1","At",41.375,42.5]
["042|G4","77, 0, 96",{"$nulls":4},"Show","042|G4",{"$nulls":4},2839.392578125,7531.45361328125,{"$nulls":12},41,null,7.1,null,"Source","S3","7.1.1","At",42.5,43.375]
["043|D4","200, 0, 120",{"$nulls":4},"Show","043|D4",{"$nulls":4},7824.2548828125,4683.00537109375,{"$nulls":12},42,null,6.1,null,null,"S1","6.1.1","",43.375,44.5]
["044|G4","77, 0, 96",{"$nulls":4},"Show","044|G4",{"$nulls":4},2174.744384765625,7214.95947265625,{"$nulls":12},43,null,7.1,null,null,"S3","7.1.1","C",44.5,45.375]
["045|D5","200, 0, 120",{"$nulls":4},"Show","045|D5",{"$nulls":4},7824.2548828125,4366.51123046875,{"$nulls":12},44,null,6.1,null,null,"S1","6.1.1","",45.375,46.5]
["046|G5","77, 0, 96",{"$nulls":4},"Show","046|G5",{"$nulls":4},2467.189453125,6898.46533203125,{"$nulls":12},45,null,7.1,null,null,"S3","7.1.1","C",46.5,48.75]
["048|Eb4","0, 12, 96",{"$nulls":4},"Show","048|Eb4",{"$nulls":4},3504.040771484375,5315.994140625,{"$nulls":12},46,null,1.1000000000000001,null,null,"S1","1.1.1","",48.75,50.875]
["050|Db5","0, 12, 96",{"$nulls":4},"Show","050|Db5",{"$nulls":4},3171.716796875,4683.00537109375,{"$nulls":12},47,null,1.1000000000000001,null,null,"S1","1.1.1","",50.875,52]
["052|Bb4","0, 12, 96",{"$nulls":4},"Show","052|Bb4",{"$nulls":4},4168.689453125,4999.5,{"$nulls":12},48,null,1.1000000000000001,null,null,"S1","1.1.1","",52,53.875]
["053|Db5","0, 12, 96",{"$nulls":4},"Show","053|Db5",{"$nulls":4},3171.716796875,4366.51123046875,{"$nulls":12},49,null,1.1000000000000001,null,null,"S1","1.1.1","",53.875,55.25]
["055|Gb5","191, 0, 0",{"$nulls":4},"Show","055|Gb5",{"$nulls":4},5830.31005859375,4999.5,{"$nulls":12},50,null,1.6,null,null,"S1","1.6.1","",55.75,57.75]
["057|Gb5","191, 0, 0",{"$nulls":4},"Show","057|Gb5",{"$nulls":4},6494.95849609375,4683.00537109375,{"$nulls":12},51,null,1.6,null,null,"S1","1.6.1","",57.75,59.75]
["059|Gb5","191, 0, 0",{"$nulls":4},"Show","059|Gb5",{"$nulls":4},4833.33740234375,4366.51123046875,{"$nulls":12},52,null,1.6,null,null,"S1","1.6.1","",59.75,61]
["061|A4","230, 120, 0",{"$nulls":4},"Show","061|A4",{"$nulls":4},5497.98583984375,4366.51123046875,{"$nulls":12},53,null,3.1,null,null,"S1","3.1.1","",61.125,61.5]
["061|Bb4","230, 120, 0",{"$nulls":4},"Show","061|Bb4",{"$nulls":4},5165.662109375,4050.017333984375,{"$nulls":12},54,null,3.1,null,null,"S1","3.1.1","",61.625,62]
["062|C5","230, 120, 0",{"$nulls":4},"Show","062|C5",{"$nulls":4},5830.31005859375,3733.523193359375,{"$nulls":12},55,null,3.1,null,null,"S1","3.1.1","",62.125,62.5]
["062|B4","230, 120, 0",{"$nulls":4},"Show","062|B4",{"$nulls":4},5830.31005859375,3417.02880859375,{"$nulls":12},56,null,3.1,null,null,"S1","3.1.1","",62.625,63.25]
["063|Ab5","191, 0, 0",{"$nulls":4},"Show","063|Ab5",{"$nulls":4},5165.662109375,4683.00537109375,{"$nulls":12},57,null,1.6,null,null,"S1","1.6.1","",63.75,65.75]
["065|Ab5","191, 0, 0",{"$nulls":4},"Show","065|Ab5",{"$nulls":4},6827.28271484375,4366.51123046875,{"$nulls":12},58,null,1.6,null,null,"S1","1.6.1","",65.75,67.75]
["067|Ab3","191, 0, 0",{"$nulls":4},"Show","067|Ab3",{"$nulls":4},6827.28271484375,4050.017333984375,{"$nulls":12},59,null,1.6,null,null,"S1","1.6.1","",67.75,69.75]
["069|B4","91, 0, 191",{"$nulls":4},"Show","069|B4",{"$nulls":4},1842.4200439453125,6581.97119140625,{"$nulls":12},60,null,1.2,null,"Source","S4","1.2.1","At",69.25,69.75]
["069|Gb3","191, 0, 0",{"$nulls":4},"Show","069|Gb3",{"$nulls":4},6827.28271484375,3733.523193359375,{"$nulls":12},61,null,1.6,null,null,"S1","1.6.1","",69.75,71.75]
["071|A4","91, 0, 191",{"$nulls":4},"Show","071|A4",{"$nulls":4},1842.4200439453125,6265.47705078125,{"$nulls":12},62,null,1.2,null,null,"S4","1.2.1","",71.25,71.75]
["071|Fb3","191, 0, 0",{"$nulls":4},"Show","071|Fb3",{"$nulls":4},6827.28271484375,3417.02880859375,{"$nulls":12},63,null,1.6,null,null,"S1","1.6.1","",71.75,73.75]
["073|G4","91, 0, 191",{"$nulls":4},"Show","073|G4",{"$nulls":4},1842.4200439453125,5948.982421875,{"$nulls":12},64,null,1.2,null,null,"S4","1.2.1","",73.5,75]
["075|F4","91, 0, 191",{"$nulls":4},"Show","075|F4",{"$nulls":4},1842.4200439453125,5632.48828125,{"$nulls":12},65,null,1.2,null,null,"S4","1.2.1","",75.5,77]
["077|E4","91, 0, 191",{"$nulls":4},"Show","077|E4",{"$nulls":4},1842.4200439453125,5315.994140625,{"$nulls":12},66,null,1.2,null,null,"S4","1.2.1","",77.5,79]
["081|C5","0, 98, 130",{"$nulls":4},"Show","081|C5",{"$nulls":4},1510.095947265625,7214.95947265625,{"$nulls":12},67,null,1.3,null,"Source","S5","1.3.1","At",81.75,82.25]
["082|F5","0, 98, 130",{"$nulls":4},"Show","082|F5",{"$nulls":4},180.79937744140625,6898.46533203125,{"$nulls":12},68,null,1.3,null,null,"S5","1.3.1","",82.75,83.25]
["083|C6","0, 98, 130",{"$nulls":4},"Show","083|C6",{"$nulls":4},513.12353515625,6581.97119140625,{"$nulls":12},69,null,1.3,null,null,"S5","1.3.1","",83.75,84.25]
["084|F6","0, 98, 130",{"$nulls":4},"Show","084|F6",{"$nulls":4},805.56878662109375,6265.47705078125,{"$nulls":12},70,null,1.3,null,null,"S5","1.3.1","",84.5,85.25]
["085|C5","0, 98, 130",{"$nulls":4},"Show","085|C5",{"$nulls":4},1510.095947265625,5315.994140625,{"$nulls":12},71,null,1.3,null,null,"S5","1.3.1","",85.75,86.5]
["086|F5","0, 98, 130",{"$nulls":4},"Show","086|F5",{"$nulls":4},180.79937744140625,5315.994140625,{"$nulls":12},72,null,1.3,null,null,"S5","1.3.1","",86.75,87.5]
["087|C6","0, 98, 130",{"$nulls":4},"Show","087|C6",{"$nulls":4},513.12353515625,5315.994140625,{"$nulls":12},73,null,1.3,null,null,"S5","1.3.1","",87.75,88.5]
["088|F6","0, 98, 130",{"$nulls":4},"Show","088|F6",{"$nulls":4},845.44769287109375,5948.982421875,{"$nulls":12},74,null,1.3,null,null,"S5","1.3.1","",88.75,89.5]
["089|Db6","0, 98, 130",{"$nulls":4},"Show","089|Db6",{"$nulls":4},845.44769287109375,5632.48828125,{"$nulls":12},75,null,1.3,null,null,"S5","1.3.1","",89.75,90.5]
["090|F6","0, 98, 130",{"$nulls":4},"Show","090|F6",{"$nulls":4},1177.7718505859375,5632.48828125,{"$nulls":12},76,null,1.3,null,null,"S5","1.3.1","",90.75,91.5]
["091|Db6","0, 98, 130",{"$nulls":4},"Show","091|Db6",{"$nulls":4},845.44769287109375,5315.994140625,{"$nulls":12},77,null,1.3,null,null,"S5","1.3.1","",91.75,92.5]
["092|F6","0, 98, 130",{"$nulls":4},"Show","092|F6",{"$nulls":4},1177.7718505859375,5315.994140625,{"$nulls":12},78,null,1.3,null,null,"S5","1.3.1","",92.75,93.25]
["095|Ab4","0, 12, 96",{"$nulls":4},"Show","095|Ab4",{"$nulls":4},8156.5791015625,5315.994140625,{"$nulls":12},79,null,1.1000000000000001,null,null,"S1","1.1.1","",95.375,95.75]
["096|Eb6","0, 12, 96",{"$nulls":4},"Show","096|Eb6",{"$nulls":4},8156.5791015625,4999.5,{"$nulls":12},80,null,1.1000000000000001,null,null,"S1","1.1.1","",96.375,96.75]
["097|F4","0, 12, 96",{"$nulls":4},"Show","097|F4",{"$nulls":4},8488.9033203125,4999.5,{"$nulls":12},81,null,1.1000000000000001,null,null,"S1","1.1.1","",97.375,97.75]
["098|Db6","0, 12, 96",{"$nulls":4},"Show","098|Db6",{"$nulls":4},8156.5791015625,4683.00537109375,{"$nulls":12},82,null,1.1000000000000001,null,null,"S1","1.1.1","",98.375,98.75]
["099|Eb4","0, 12, 96",{"$nulls":4},"Show","099|Eb4",{"$nulls":4},8488.9033203125,4683.00537109375,{"$nulls":12},83,null,1.1000000000000001,null,null,"S1","1.1.1","",99.375,99.75]
["100|C6","0, 12, 96",{"$nulls":4},"Show","100|C6",{"$nulls":4},8156.5791015625,4366.51123046875,{"$nulls":12},84,null,1.1000000000000001,null,null,"S1","1.1.1","",100.375,100.75]
["101|F4","0, 12, 96",{"$nulls":4},"Show","101|F4",{"$nulls":4},4833.33740234375,5315.994140625,{"$nulls":12},85,null,1.1000000000000001,null,null,"S1","1.1.1","",101,103]
["103|G4","0, 12, 96",{"$nulls":4},"Show","103|G4",{"$nulls":4},3836.365234375,4999.5,{"$nulls":12},86,null,1.1000000000000001,null,null,"S1","1.1.1","",103,104.875]
["104|C5","0, 12, 96",{"$nulls":4},"Show","104|C5",{"$nulls":4},3171.716796875,4999.5,{"$nulls":12},87,null,1.1000000000000001,null,null,"S1","1.1.1","",104.875,105.875]
["105|C5","0, 12, 96",{"$nulls":4},"Show","105|C5",{"$nulls":4},3836.365234375,4683.00537109375,{"$nulls":12},88,null,1.1000000000000001,null,null,"S1","1.1.1","",105.875,107]
["107|C6","0, 136, 227",{"$nulls":4},"Show","107|C6",{"$nulls":4},3504.040771484375,4366.51123046875,{"$nulls":12},89,null,2.1,null,null,"S1","2.1.1","",107,108.75]
["108|C3","0, 12, 96",{"$nulls":4},"Show","108|C3",{"$nulls":4},4501.01318359375,4999.5,{"$nulls":12},90,null,1.1000000000000001,null,null,"S1","1.1.1","",108.75,112]
["111|Bb5","0, 12, 96",{"$nulls":4},"Show","111|Bb5",{"$nulls":4},4501.01318359375,4683.00537109375,{"$nulls":12},91,null,1.1000000000000001,null,null,"S1","1.1.1","C",111,113.375]
["112|Db5","0, 12, 96",{"$nulls":4},"Show","112|Db5",{"$nulls":4},4501.01318359375,4366.51123046875,{"$nulls":12},92,null,1.1000000000000001,null,"WI Epiphany","S1","1.1.1","C",112.375,114.375]
["113|Gb5","0, 12, 96",{"$nulls":4},"Show","113|Gb5",{"$nulls":4},4168.689453125,4366.51123046875,{"$nulls":12},93,null,1.1000000000000001,null,"WI Epiphany","S1","1.1.1","C",113.375,115]
["114|C5","0, 12, 96",{"$nulls":4},"Show","114|C5",{"$nulls":4},4168.689453125,4050.017333984375,{"$nulls":12},94,null,1.1000000000000001,null,"WI Epiphany","S1","1.1.1","C",114.375,116]
["115|G5","0, 12, 96",{"$nulls":4},"Show","115|G5",{"$nulls":4},4168.689453125,3733.523193359375,{"$nulls":12},95,null,1.1000000000000001,null,null,"S1","1.1.1","Ai",115.375,117.25]
["117|E5","213, 218, 255",{"$nulls":4},"Show","117|E5",{"$nulls":4},4168.689453125,3417.02880859375,{"$nulls":12},96,null,1.7,null,null,"S1","1.7.1","At",117.25,119.25]
["119|Db5","191, 0, 0",{"$nulls":4},"Show","119|Db5",{"$nulls":4},7491.93115234375,4999.5,{"$nulls":12},97,null,1.6,null,null,"S1","1.6.1","",119.75,121.75]
["121|Db6","191, 0, 0",{"$nulls":4},"Show","121|Db6",{"$nulls":4},6162.6337890625,4683.00537109375,{"$nulls":12},98,null,1.6,null,null,"S1","1.6.1","",121.75,123.75]
["123|Db6","191, 0, 0",{"$nulls":4},"Show","123|Db6",{"$nulls":4},5165.662109375,4366.51123046875,{"$nulls":12},99,null,1.6,null,null,"S1","1.6.1","",123.75,125]
["125|E5","230, 120, 0",{"$nulls":4},"Show","125|E5",{"$nulls":4},6494.95849609375,4366.51123046875,{"$nulls":12},100,null,3.1,null,null,"S1","3.1.1","",125.125,125.5]
["125|F5","230, 120, 0",{"$nulls":4},"Show","125|F5",{"$nulls":4},6162.6337890625,4050.017333984375,{"$nulls":12},101,null,3.1,null,null,"S1","3.1.1","",125.625,126]
["126|G5","230, 120, 0",{"$nulls":4},"Show","126|G5",{"$nulls":4},5497.98583984375,3733.523193359375,{"$nulls":12},102,null,3.1,null,null,"S1","3.1.1","",126.125,126.5]
["126|B5","230, 120, 0",{"$nulls":4},"Show","126|B5",{"$nulls":4},5497.98583984375,3417.02880859375,{"$nulls":12},103,null,3.1,null,null,"S1","3.1.1","",126.625,127.25]
["127|B5","230, 120, 0",{"$nulls":4},"Show","127|B5",{"$nulls":4},5165.662109375,3100.53466796875,{"$nulls":12},104,null,3.1,null,null,"S1","3.1.1","",127.625,128.25]
["128|E5","230, 120, 0",{"$nulls":4},"Show","128|E5",{"$nulls":4},5165.662109375,2784.04052734375,{"$nulls":12},105,null,3.1,null,null,"S1","3.1.1","",128.625,129.25]
["129|E5","230, 120, 0",{"$nulls":4},"Show","129|E5",{"$nulls":4},4833.33740234375,2467.545654296875,{"$nulls":12},106,null,3.1,null,null,"S1","3.1.1","",129.625,130]
["130|E5","230, 120, 0",{"$nulls":4},"Show","130|E5",{"$nulls":4},6494.95849609375,4050.017333984375,{"$nulls":12},107,null,3.1,null,null,"S1","3.1.1","",130.125,130.5]
["130|F5","230, 120, 0",{"$nulls":4},"Show","130|F5",{"$nulls":4},6162.6337890625,3733.523193359375,{"$nulls":12},108,null,3.1,null,null,"S1","3.1.1","",130.625,131]
["131|G5","230, 120, 0",{"$nulls":4},"Show","131|G5",{"$nulls":4},4833.33740234375,3417.02880859375,{"$nulls":12},109,null,3.1,null,null,"S1","3.1.1","",131.125,131.5]
["131|A5","230, 120, 0",{"$nulls":4},"Show","131|A5",{"$nulls":4},4501.01318359375,3100.53466796875,{"$nulls":12},110,null,3.1,null,null,"S1","3.1.1","",131.625,132]
["132|Ab2","255, 191, 0",{"$nulls":4},"Show","132|Ab2",{"$nulls":4},9485.875,4999.5,{"$nulls":12},111,null,4.0999999999999996,null,null,"S1","4.1.1","",132,133]
["132|C6","230, 120, 0",{"$nulls":4},"Show","132|C6",{"$nulls":4},4501.01318359375,2784.04052734375,{"$nulls":12},112,null,3.1,null,null,"S1","3.1.1","",132.125,133.125]
["133|Bb2","255, 191, 0",{"$nulls":4},"Show","133|Bb2",{"$nulls":4},9818.2001953125,4683.00537109375,{"$nulls":12},113,null,4.0999999999999996,null,null,"S1","4.1.1","",133,134]
["134|C3","255, 191, 0",{"$nulls":4},"Show","134|C3",{"$nulls":4},9485.875,4366.51123046875,{"$nulls":12},114,null,4.0999999999999996,null,null,"S1","4.1.1","",134,135]
["134|Ab3","191, 0, 0",{"$nulls":4},"Show","134|Ab3",{"$nulls":4},6827.28271484375,4683.00537109375,{"$nulls":12},115,null,1.6,null,null,"S1","1.6.1","",134.75,136]
["136|Ab2","255, 191, 0",{"$nulls":4},"Show","136|Ab2",{"$nulls":4},8821.2275390625,4683.00537109375,{"$nulls":12},116,null,4.0999999999999996,null,null,"S1","4.1.1","",136,137]
["136|C6","230, 120, 0",{"$nulls":4},"Show","136|C6",{"$nulls":4},4168.689453125,2467.545654296875,{"$nulls":12},117,null,3.1,null,null,"S1","3.1.1","",136.125,137.125]
["137|Bb2","255, 191, 0",{"$nulls":4},"Show","137|Bb2",{"$nulls":4},9153.5517578125,4366.51123046875,{"$nulls":12},118,null,4.0999999999999996,null,null,"S1","4.1.1","",137,138]
["138|C3","255, 191, 0",{"$nulls":4},"Show","138|C3",{"$nulls":4},9818.2001953125,4050.017333984375,{"$nulls":12},119,null,4.0999999999999996,null,null,"S1","4.1.1","",138,139]
["140|Ab4","200, 0, 120",{"$nulls":4},"Show","140|Ab4",{"$nulls":4},7491.93115234375,4683.00537109375,{"$nulls":12},120,null,6.1,null,null,"S1","6.1.1","",140.5,141.5]
["141|E4","77, 0, 96",{"$nulls":4},"Show","141|E4",{"$nulls":4},2839.392578125,5315.994140625,{"$nulls":12},121,null,7.1,null,null,"S3","7.1.1","",141.5,142.5]
["142|Ab4","200, 0, 120",{"$nulls":4},"Show","142|Ab4",{"$nulls":4},7491.93115234375,4366.51123046875,{"$nulls":12},122,null,6.1,null,null,"S1","6.1.1","",142.5,143.5]
["143|E4","77, 0, 96",{"$nulls":4},"Show","143|E4",{"$nulls":4},2174.744384765625,5315.994140625,{"$nulls":12},123,null,7.1,null,null,"S3","7.1.1","",143.5,144.375]
["144|B4","200, 0, 120",{"$nulls":4},"Show","144|B4",{"$nulls":4},7824.2548828125,4050.017333984375,{"$nulls":12},124,null,6.1,null,null,"S1","6.1.1","",144.375,145.5]
["145|E5","77, 0, 96",{"$nulls":4},"Show","145|E5",{"$nulls":4},2467.189453125,6581.97119140625,{"$nulls":12},125,null,7.1,null,null,"S3","7.1.1","C",145.5,147.25]
["147|Bb5","77, 0, 96",{"$nulls":4},"Show","147|Bb5",{"$nulls":4},2467.189453125,6265.47705078125,{"$nulls":12},126,null,7.1,null,null,"S3","7.1.1","Ai",147.875,149.25]
["149|Ab5","213, 238, 255",{"$nulls":4},"Show","149|Ab5",{"$nulls":4},2467.189453125,5948.982421875,{"$nulls":12},127,null,1.8,null,null,"S3","1.8.1","At",149.75,150.25]
["150|G5","213, 238, 255",{"$nulls":4},"Show","150|G5",{"$nulls":4},2467.189453125,5632.48828125,{"$nulls":12},128,null,1.8,null,null,"S3","1.8.1","Ai",150.25,150.75]
["150|F5","213, 255, 234",{"$nulls":4},"Show","150|F5",{"$nulls":4},2507.068359375,5315.994140625,{"$nulls":12},129,null,8.1,null,null,"S3","8.1.1","At",150.75,152.25]

{"sheet":"Vertices PivotTable","index":3,"n_rows":9,"n_cols":2,"rows_kept":9,"cut":false,"hidden":false,"merged":[]}
[]
[]
["Row Labels","Count of Family"]
["S1",97]
["S2",3]
["S3",10]
["S4",5]
["S5",12]
["Grand Total",127]

{"sheet":"Edges","index":4,"n_rows":678,"n_cols":23,"rows_kept":678,"cut":false,"hidden":false,"merged":[]}
[null,null,"Visual Properties",{"$nulls":4},"Labels",null,null,"Graph Metrics","Do Not Edit"]
["Vertex 1","Vertex 2","Color","Width","Style","Opacity","Visibility","Label","Label Text Color","Label Font Size","Reciprocated?","ID","Dynamic Filter","D*","D","S","T","N+","N","Thematic Repetition","Progression","Role","CDRE"]
["000|C4","003|G4","128, 255, 0",{"$nulls":8},3,null,1,1,1,null,1,null,null,"Y"]
["003|G4","004|C5","128, 255, 0",{"$nulls":8},4,null,null,null,1]
["000|C4","004|C5",{"$nulls":9},5,null,1,1,null,null,1,null,"IMM: 000|C4-003|G4/004|C5-005|C5"]
["004|C5","005|C5","128, 255, 0",{"$nulls":4},"R",null,null,null,6,null,1,1,1,1,1,null,null,"Y",null,"R"]
["003|G4","005|C5",{"$nulls":9},7,null,1,1,null,null,1,null,"IMM: 000|C4-003|G4/004|C5-005|C5"]
["005|C5","007|C6","128, 255, 0",2,{"$nulls":7},8,null,1,1,1,null,1,1,null,"Y","x-Developing"]
["007|C6","008|G2","128, 255, 0",{"$nulls":8},9,null,null,null,1]
["000|C4","008|G2",{"$nulls":5},"E",null,null,null,10,null,1,1,null,1,1,{"$nulls":4},"E"]
["008|G2","012|Bb4","128, 255, 0",{"$nulls":8},11,null,null,null,1]
["008|G2","011|Eb5",{"$nulls":5},"E",null,null,null,12,null,1,1,null,1,1,{"$nulls":4},"E"]
["011|Eb5","013|Eb5","128, 255, 0",{"$nulls":4},"E",null,null,null,13,null,1,1,1,1,1,null,null,"Y",null,"E"]
["011|Eb5","012|Bb4",{"$nulls":5},"R",null,null,null,14,null,1,1,null,1,1,null,"SIM: 011|Eb5-013|Eb5/012|Bb4-014|Db5",null,null,"R"]
["012|Bb4","014|Db5","128, 255, 0",{"$nulls":4},"R",null,null,null,15,null,null,null,1,1,{"$nulls":5},"R"]
["013|Eb5","014|Db5","128, 255, 0",{"$nulls":8},16,null,1,1,1,null,null,null,"SIM: 011|Eb5-013|Eb5/012|Bb4-014|Db5","Y"]
["014|Db5","015|C5","128, 255, 0",{"$nulls":8},17,null,null,null,1]
["015|C5","016|Eb5","128, 255, 0",2,{"$nulls":7},18,null,1,1,1,null,1,1,null,"Y","Developing"]
["016|Eb5","018|Eb5","128, 255, 0",{"$nulls":4},"CDR",null,null,null,19,null,1,1,1,1,null,null,null,"Y",null,"CDR"]
["018|Eb5","020|Fb5","128, 255, 0",{"$nulls":8},20,null,null,null,1]
["000|C4","020|Fb5",null,2,{"$nulls":7},21,null,1,1,null,null,1,1,null,null,"Developing"]
["020|Fb5","022|Fb5","128, 255, 0",{"$nulls":4},"CDR",null,null,null,22,null,1,1,1,1,1,null,null,"Y",null,"CDR"]
["022|Fb5","024|Fb5","128, 255, 0",{"$nulls":4},"E",null,null,null,23,null,1,1,1,1,null,null,null,"Y",null,"E"]
["024|Fb5","026|G4","128, 255, 0",{"$nulls":8},24,null,null,null,1]
["022|Fb5","026|G4",null,2,{"$nulls":7},25,null,1,1,null,null,1,1,null,null,"x-Developing"]
["026|G4","026|A4","128, 255, 0",{"$nulls":4},"CD",null,null,null,26,null,1,1,1,1,null,null,null,"Y",null,"CD"]
["026|A4","027|B4","128, 255, 0",{"$nulls":4},"D",null,null,null,27,null,1,1,1,1,null,null,null,"Y",null,"D"]
["027|B4","027|D5","128, 255, 0",{"$nulls":8},28,null,1,1,1,{"$nulls":4},"Y"]
["027|D5","028|D5","128, 255, 0",{"$nulls":4},"CDR",null,null,null,29,null,1,1,1,1,null,null,null,"Y",null,"CDR"]
["028|D5","029|G5","128, 255, 0",{"$nulls":4},"R",null,null,null,30,null,1,1,1,1,null,null,null,"Y",null,"R"]
["029|G5","030|G5","128, 255, 0",{"$nulls":4},"E",null,null,null,31,null,1,1,1,1,null,null,null,"Y",null,"E"]
["030|G5","031|G5","128, 255, 0",{"$nulls":8},32,null,null,null,1]
["026|G4","031|G5",{"$nulls":5},"CDR",null,null,null,33,null,1,1,null,1,null,null,"026|G4-027|B4/031|G5-032|B5",null,null,"CDR"]
["031|G5","031|A5","128, 255, 0",{"$nulls":4},"CD",null,null,null,34,null,null,null,1,1,{"$nulls":5},"CD"]
["026|A4","031|A5",{"$nulls":5},"CDR",null,null,null,35,null,1,1,null,1,null,null,"026|G4-027|B4/031|G5-032|B5",null,null,"CDR"]
["031|A5","032|B5","128, 255, 0",{"$nulls":4},"D",null,null,null,36,null,null,null,1,1,{"$nulls":5},"D"]
["027|B4","032|B5",{"$nulls":5},"CDR",null,null,null,37,null,1,1,null,1,null,null,"026|G4-027|B4/031|G5-032|B5",null,null,"CDR"]
["032|B5","032|C6","128, 255, 0",{"$nulls":4},"D",null,null,null,38,null,1,1,1,1,null,null,null,"Y",null,"D"]
["032|C6","033|D6","128, 255, 0",{"$nulls":8},39,null,1,1,1,{"$nulls":4},"Y"]
["000|C4","033|C3",null,2,{"$nulls":7},40,null,1,1,null,null,1,1,null,null,"x-Developing"]
["033|C3","034|Db3","128, 255, 0",{"$nulls":4},"DR",null,null,null,41,null,1,1,1,1,null,null,null,"Y",null,"DR"]
["033|D6","035|Eb3","128, 255, 0",{"$nulls":8},42,null,null,null,1]
["034|Db3","035|Eb3","128, 255, 0",{"$nulls":4},"R",null,null,null,43,null,1,1,1,1,null,null,null,"Y",null,"R"]
["035|Eb3","035|C4","128, 255, 0",{"$nulls":8},44,null,null,null,1]
["020|Fb5","035|C4",{"$nulls":9},45,null,1,1,null,null,1]
["035|C4","037|C2","128, 255, 0",{"$nulls":8},46,null,null,null,1]
["033|C3","037|C2",{"$nulls":5},"CDR",null,null,null,47,null,1,1,null,1,null,null,"IMM: 033|C3-035|C4/037|C2-039|C3",null,null,"CDR"]
["037|C2","038|Db2","128, 255, 0",{"$nulls":4},"DR",null,null,null,48,null,null,null,1,1,{"$nulls":5},"DR"]
["033|D6","037|Ab5",{"$nulls":5},"R",null,null,null,49,null,1,1,null,1,null,null,"IMM: 033|C3-035|C4/037|C2-039|C3",null,null,"R"]
["037|Ab5","039|Eb2","128, 255, 0",{"$nulls":8},50,null,null,null,1]
["034|Db3","038|Db2",{"$nulls":5},"CDR",null,null,null,51,null,1,1,null,1,null,null,"IMM: 033|C3-035|C4/037|C2-039|C3",null,null,"CDR"]
["038|Db2","039|Eb2","128, 255, 0",{"$nulls":4},"R",null,null,null,52,null,null,null,1,1,{"$nulls":5},"R"]
["035|Eb3","039|Eb2",{"$nulls":5},"CDR",null,null,null,53,null,1,1,null,1,null,null,"IMM: 033|C3-035|C4/037|C2-039|C3",null,null,"CDR"]
["039|Eb2","039|C3","128, 255, 0",{"$nulls":8},54,null,null,null,1]
["035|C4","039|C3",null,2,{"$nulls":7},55,null,1,1,null,null,1,1,"IMM: 033|C3-035|C4/037|C2-039|C3",null,"x-Developing"]
["039|C3","041|D4","128, 255, 0",{"$nulls":8},56,null,null,null,1]
["020|Fb5","041|D4",null,2,{"$nulls":7},57,null,1,1,null,null,1,1,null,null,"x-Developing"]
["041|D4","042|G4","128, 255, 0",{"$nulls":8},58,null,null,null,1]
["042|G4","043|D4","128, 255, 0",{"$nulls":8},59,null,null,null,1]
["041|D4","043|D4",{"$nulls":5},"CDR",null,null,null,60,null,1,1,null,1,null,null,"IMM: 041|D4-042|G4/043|D4-044|G4",null,null,"CDR"]
["043|D4","044|G4","128, 255, 0",{"$nulls":8},61,null,null,null,1]
["042|G4","044|G4",{"$nulls":5},"CDR",null,null,null,62,null,1,1,null,1,1,null,"IMM: 041|D4-042|G4/043|D4-044|G4",null,null,"CDR"]
["044|G4","045|D5","128, 255, 0",{"$nulls":8},63,null,null,null,1]
["043|D4","045|D5",{"$nulls":5},"CDR",null,null,null,64,null,1,1,null,1,null,null,"IMM: 043|D4-044|G4/045|D5-046|G5",null,null,"CDR"]
["045|D5","046|G5","128, 255, 0",{"$nulls":8},65,null,null,null,1]
["044|G4","046|G5",{"$nulls":5},"CD",null,null,null,66,null,1,1,null,1,1,null,"IMM: 043|D4-044|G4/045|D5-046|G5",null,null,"CD"]
["046|G5","048|Eb4","128, 255, 0",{"$nulls":8},67,null,null,null,1]
["000|C4","048|Eb4",{"$nulls":5},"DR",null,null,null,68,null,1,1,null,1,{"$nulls":5},"DR"]
["048|Eb4","050|Db5","128, 255, 0",{"$nulls":8},69,null,null,null,1]
["005|C5","050|Db5",{"$nulls":5},"R",null,null,null,70,null,1,1,null,1,{"$nulls":5},"R"]
["050|Db5","052|Bb4","128, 255, 0",{"$nulls":4},"E",null,null,null,71,null,null,null,1,1,{"$nulls":5},"E"]
["003|G4","052|Bb4",{"$nulls":9},72,null,1,1]
["052|Bb4","053|Db5","128, 255, 0",{"$nulls":8},73,null,null,null,1]
["050|Db5","053|Db5",{"$nulls":5},"E",null,null,null,74,null,1,1,null,1,{"$nulls":5},"E"]
["053|Db5","055|Gb5","128, 255, 0",{"$nulls":8},75,null,null,null,1]
["020|Fb5","055|Gb5",{"$nulls":5},"CDR",null,null,null,76,null,1,1,null,1,null,null,"020|Fb5-027|D5/055|Gb5-062|B4",null,null,"CDR"]
["055|Gb5","057|Gb5","128, 255, 0",{"$nulls":4},"CDR",null,null,null,77,null,null,null,1,1,{"$nulls":5},"CDR"]
["022|Fb5","057|Gb5",{"$nulls":5},"CDR",null,null,null,78,null,1,1,null,1,null,null,"020|Fb5-027|D5/055|Gb5-062|B4",null,null,"CDR"]
["057|Gb5","059|Gb5","128, 255, 0",{"$nulls":4},"E",null,null,null,79,null,null,null,1,1,{"$nulls":5},"E"]
["024|Fb5","059|Gb5",{"$nulls":5},"CDR",null,null,null,80,null,1,1,null,1,null,null,"020|Fb5-027|D5/055|Gb5-062|B4",null,null,"CDR"]
["059|Gb5","061|A4","128, 255, 0",{"$nulls":8},81,null,null,null,1]
["026|G4","061|A4",{"$nulls":5},"CDR",null,null,null,82,null,1,1,null,1,null,null,"020|Fb5-027|D5/055|Gb5-062|B4",null,null,"CDR"]
["061|A4","061|Bb4","128, 255, 0",{"$nulls":4},"D",null,null,null,83,null,null,null,1,1,{"$nulls":5},"D"]
["026|A4","061|Bb4",{"$nulls":5},"DR",null,null,null,84,null,1,1,null,1,null,null,"020|Fb5-027|D5/055|Gb5-062|B4",null,null,"DR"]
["061|Bb4","062|C5","128, 255, 0",{"$nulls":4},"D",null,null,null,85,null,null,null,1,1,{"$nulls":5},"D"]
["027|B4","062|C5",{"$nulls":5},"DR",null,null,null,86,null,1,1,null,1,null,null,"020|Fb5-027|D5/055|Gb5-062|B4",null,null,"DR"]
["062|C5","062|B4","128, 255, 0",{"$nulls":8},87,null,null,null,1]
["027|D5","062|B4",{"$nulls":5},"R",null,null,null,88,null,1,1,null,1,null,null,"020|Fb5-027|D5/055|Gb5-062|B4",null,null,"R"]
["062|B4","063|Ab5","128, 255, 0",{"$nulls":8},89,null,null,null,1]
["055|Gb5","063|Ab5",{"$nulls":5},"CDR",null,null,null,90,null,1,1,null,1,null,null,"055|Gb5-057|Gb5/063|Ab5-065|Ab5",null,null,"CDR"]
["063|Ab5","065|Ab5","128, 255, 0",{"$nulls":4},"CDR",null,null,null,91,null,null,null,1,1,{"$nulls":5},"CDR"]
["057|Gb5","065|Ab5",{"$nulls":5},"CDR",null,null,null,92,null,1,1,null,1,null,null,"055|Gb5-057|Gb5/063|Ab5-065|Ab5",null,null,"CDR"]
["065|Ab5","067|Ab3","128, 255, 0",{"$nulls":4},"CDR",null,null,null,93,null,1,1,1,1,null,null,null,"Y",null,"CDR"]
["067|Ab3","069|Gb3","128, 255, 0",{"$nulls":4},"CDR",null,null,null,94,null,1,1,1,1,null,null,null,"Y",null,"CDR"]
["069|B4","069|Gb3","128, 255, 0",{"$nulls":8},95,null,null,null,1]
["069|Gb3","071|Fb3","128, 255, 0",{"$nulls":8},96,null,1,1,1,null,null,null,"SIM: 069|B4-069|Gb3/071|A4-071|Fb3","Y"]
["069|B4","071|A4",{"$nulls":5},"CDR",null,null,null,97,null,1,1,null,1,null,null,"SIM: 069|B4-069|Gb3/071|A4-071|Fb3",null,null,"CDR"]
["071|A4","071|Fb3","128, 255, 0",{"$nulls":8},98,null,null,null,1]
["071|Fb3","075|F4","128, 255, 0",{"$nulls":8},99,null,null,null,1]
["071|A4","073|G4",{"$nulls":5},"CD",null,null,null,100,null,1,1,null,1,{"$nulls":5},"CD"]
["073|G4","075|F4","128, 255, 0",{"$nulls":4},"DR",null,null,null,101,null,1,1,1,1,null,null,null,"Y",null,"DR"]
["075|F4","077|E4","128, 255, 0",{"$nulls":4},"DR",null,null,null,102,null,1,1,1,1,null,null,null,"Y",null,"DR"]
["077|E4","081|C5","128, 255, 0",{"$nulls":8},103,null,null,null,1]
["081|C5","082|F5","128, 255, 0",{"$nulls":4},"R",null,null,null,104,null,1,1,1,1,null,null,null,"Y",null,"R"]
["082|F5","083|C6","128, 255, 0",{"$nulls":4},"R",null,null,null,105,null,1,1,1,1,null,null,null,"Y",null,"R"]
["083|C6","084|F6","128, 255, 0",{"$nulls":8},106,null,1,1,1,{"$nulls":4},"Y"]
["084|F6","085|C5","128, 255, 0",{"$nulls":8},107,null,null,null,1]
["081|C5","085|C5",{"$nulls":5},"E",null,null,null,108,null,1,1,null,1,null,null,"IMM: 081|C5-084|F6/085|C5-088|F6",null,null,"E"]
["085|C5","086|F5","128, 255, 0",{"$nulls":4},"R",null,null,null,109,null,null,null,1,1,{"$nulls":5},"R"]
["082|F5","086|F5",{"$nulls":5},"E",null,null,null,110,null,1,1,null,1,null,null,"IMM: 081|C5-084|F6/085|C5-088|F6",null,null,"E"]
["086|F5","087|C6","128, 255, 0",{"$nulls":4},"R",null,null,null,111,null,null,null,1,1,{"$nulls":5},"R"]
["083|C6","087|C6",{"$nulls":5},"E",null,null,null,112,null,1,1,null,1,null,null,"IMM: 081|C5-084|F6/085|C5-088|F6",null,null,"E"]
["087|C6","088|F6","128, 255, 0",{"$nulls":4},"R",null,null,null,113,null,null,null,1,1,{"$nulls":5},"R"]
["084|F6","088|F6",{"$nulls":9},114,null,1,1,{"$nulls":4},"IMM: 081|C5-084|F6/085|C5-088|F6"]
["088|F6","089|Db6","128, 255, 0",{"$nulls":4},"CDR",null,null,null,115,null,1,1,1,1,null,null,null,"Y",null,"CDR"]
["089|Db6","090|F6","128, 255, 0",{"$nulls":4},"CDR",null,null,null,116,null,null,null,1,1,{"$nulls":5},"CDR"]
["088|F6","090|F6",{"$nulls":5},"CDR",null,null,null,117,null,1,1,null,1,null,null,"IMM: 088|F6-089|Db6/090|F6-091|Db6",null,null,"CDR"]
["090|F6","091|Db6","128, 255, 0",{"$nulls":4},"CDR",null,null,null,118,null,null,null,1,1,{"$nulls":5},"CDR"]
["089|Db6","091|Db6",{"$nulls":5},"CDR",null,null,null,119,null,1,1,null,1,null,null,"IMM: 088|F6-089|Db6/090|F6-091|Db6",null,null,"CDR"]
["091|Db6","092|F6","128, 255, 0",{"$nulls":4},"E",null,null,null,120,null,null,null,1,1,{"$nulls":5},"E"]
["090|F6","092|F6",{"$nulls":5},"E",null,null,null,121,null,1,1,null,1,{"$nulls":5},"E"]
["092|F6","095|Ab4","128, 255, 0",{"$nulls":8},122,null,null,null,1]
["000|C4","095|Ab4",{"$nulls":5},"E",null,null,null,123,null,1,1,null,1,{"$nulls":5},"E"]
["095|Ab4","096|Eb6","128, 255, 0",{"$nulls":4},"CDR",null,null,null,124,null,1,1,1,1,null,null,null,"Y",null,"CDR"]
["096|Eb6","097|F4","128, 255, 0",{"$nulls":4},"DR",null,null,null,125,null,null,null,1,1,{"$nulls":5},"DR"]
["095|Ab4","097|F4",{"$nulls":5},"DR",null,null,null,126,null,1,1,null,1,null,null,"IMM: 095|Ab4-096|Eb6/097|F4-098|Db6",null,null,"DR"]
["097|F4","098|Db6","128, 255, 0",{"$nulls":4},"DR",null,null,null,127,null,null,null,1,1,{"$nulls":5},"DR"]
["096|Eb6","098|Db6",{"$nulls":5},"DR",null,null,null,128,null,1,1,null,1,null,null,"IMM: 095|Ab4-096|Eb6/097|F4-098|Db6",null,null,"DR"]
["098|Db6","099|Eb4","128, 255, 0",{"$nulls":4},"DR",null,null,null,129,null,null,null,1,1,{"$nulls":5},"DR"]
["097|F4","099|Eb4",{"$nulls":5},"CDR",null,null,null,130,null,1,1,null,1,null,null,"IMM: 097|F4-098|Db6/099|Eb4-100|C6",null,null,"CDR"]
["099|Eb4","100|C6","128, 255, 0",{"$nulls":4},"DR",null,null,null,131,null,null,null,1,1,{"$nulls":5},"DR"]
["098|Db6","100|C6",{"$nulls":5},"DR",null,null,null,132,null,1,1,null,1,null,null,"IMM: 097|F4-098|Db6/099|Eb4-100|C6",null,null,"DR"]
["100|C6","101|F4","128, 255, 0",{"$nulls":4},"E",null,null,null,133,null,null,null,1,1,{"$nulls":5},"E"]
["000|C4","101|F4",{"$nulls":5},"E",null,null,null,134,null,1,1,null,1,null,null,"000|C4-012|Bb4/101|F4-112|Db5",null,null,"E"]
["101|F4","103|G4","128, 255, 0",{"$nulls":4},"R",null,null,null,135,null,null,null,1,1,{"$nulls":5},"R"]
["003|G4","103|G4",{"$nulls":5},"CDR",null,null,null,136,null,1,1,null,1,null,null,"000|C4-012|Bb4/101|F4-112|Db5",null,null,"CDR"]
["103|G4","104|C5","128, 255, 0",{"$nulls":8},137,null,null,null,1]
["004|C5","104|C5",{"$nulls":5},"CDR",null,null,null,138,null,1,1,null,1,null,null,"000|C4-012|Bb4/101|F4-112|Db5",null,null,"CDR"]
["104|C5","105|C5","128, 255, 0",{"$nulls":4},"R",null,null,null,139,null,null,null,1,1,{"$nulls":5},"R"]
["005|C5","105|C5",{"$nulls":5},"CDR",null,null,null,140,null,1,1,null,1,null,null,"000|C4-012|Bb4/101|F4-112|Db5",null,null,"CDR"]
["105|C5","107|C6","128, 255, 0",{"$nulls":8},141,null,null,null,1]
["007|C6","107|C6",{"$nulls":5},"CDR",null,null,null,142,null,1,1,null,1,null,null,"000|C4-012|Bb4/101|F4-112|Db5",null,null,"CDR"]
["107|C6","108|C3","128, 255, 0",{"$nulls":8},143,null,null,null,1]
["008|G2","108|C3",{"$nulls":5},"CDR",null,null,null,144,null,1,1,null,1,null,null,"000|C4-012|Bb4/101|F4-112|Db5",null,null,"CDR"]
["108|C3","112|Db5","128, 255, 0",{"$nulls":8},145,null,null,null,1]
["011|Eb5","111|Bb5",{"$nulls":5},"E",null,null,null,146,null,1,1,null,1,1,null,"011|Eb5-013|Eb5/111|Bb5-113|Gb5",null,null,"E"]
["111|Bb5","113|Gb5","128, 255, 0",{"$nulls":8},147,null,1,1,1,null,1,null,null,"Y"]
["012|Bb4","112|Db5",{"$nulls":5},"R",null,null,null,148,null,1,1,null,1,1,null,"000|C4-012|Bb4/101|F4-112|Db5",null,null,"R"]
["111|Bb5","112|Db5",{"$nulls":9},149,null,1,1,null,null,1,null,"SIM: 111|Bb5-115|G5/112|Db5-117|E5"]
["112|Db5","114|C5","128, 255, 0",{"$nulls":4},"DR",null,null,null,150,null,1,1,1,1,1,null,null,"Y",null,"DR"]
["013|Eb5","113|Gb5",{"$nulls":9},151,null,1,1,null,null,1,null,"011|Eb5-013|Eb5/111|Bb5-113|Gb5"]
["113|Gb5","115|G5","128, 255, 0",{"$nulls":8},152,null,null,null,1]
["113|Gb5","114|C5",{"$nulls":5},"DR",null,null,null,153,null,1,1,null,1,1,null,"SIM: 111|Bb5-115|G5/112|Db5-117|E5",null,null,"DR"]
["114|C5","117|E5","128, 255, 0",{"$nulls":8},154,null,null,null,1]
["114|C5","115|G5",{"$nulls":9},155,null,1,1,null,null,1]
["115|G5","117|E5","128, 255, 0",2,{"$nulls":7},156,null,1,1,1,null,1,1,"SIM: 111|Bb5-115|G5/112|Db5-117|E5","Y","Developing"]
["117|E5","119|Db5","128, 255, 0",{"$nulls":8},157,null,null,null,1]
["020|Fb5","119|Db5",{"$nulls":5},"CDR",null,null,null,158,null,1,1,null,1,null,null,"020|Fb5-039|Eb2/119|Db5-138|C3",null,null,"CDR"]
["119|Db5","121|Db6","128, 255, 0",{"$nulls":4},"CDR",null,null,null,159,null,null,null,1,1,{"$nulls":5},"CDR"]
["022|Fb5","121|Db6",{"$nulls":5},"CDR",null,null,null,160,null,1,1,null,1,null,null,"020|Fb5-039|Eb2/119|Db5-138|C3",null,null,"CDR"]
["121|Db6","123|Db6","128, 255, 0",{"$nulls":4},"E",null,null,null,161,null,null,null,1,1,{"$nulls":5},"E"]
["024|Fb5","123|Db6",{"$nulls":5},"CDR",null,null,null,162,null,1,1,null,1,null,null,"020|Fb5-039|Eb2/119|Db5-138|C3",null,null,"CDR"]
["123|Db6","125|E5","128, 255, 0",{"$nulls":8},163,null,null,null,1]
["026|G4","125|E5",{"$nulls":5},"CDR",null,null,null,164,null,1,1,null,1,null,null,"020|Fb5-039|Eb2/119|Db5-138|C3",null,null,"CDR"]
["125|E5","125|F5","128, 255, 0",{"$nulls":4},"D",null,null,null,165,null,null,null,1,1,{"$nulls":5},"D"]
["026|A4","125|F5",{"$nulls":5},"DR",null,null,null,166,null,1,1,null,1,null,null,"020|Fb5-039|Eb2/119|Db5-138|C3",null,null,"DR"]
["125|F5","126|G5","128, 255, 0",{"$nulls":4},"D",null,null,null,167,null,null,null,1,1,{"$nulls":5},"D"]
["027|B4","126|G5",{"$nulls":5},"DR",null,null,null,168,null,1,1,null,1,null,null,"020|Fb5-039|Eb2/119|Db5-138|C3",null,null,"DR"]
["126|G5","126|B5","128, 255, 0",{"$nulls":8},169,null,null,null,1]
["027|D5","126|B5",{"$nulls":5},"CDR",null,null,null,170,null,1,1,null,1,null,null,"020|Fb5-039|Eb2/119|Db5-138|C3",null,null,"CDR"]
["126|B5","127|B5","128, 255, 0",{"$nulls":4},"CDR",null,null,null,171,null,null,null,1,1,{"$nulls":5},"CDR"]
["028|D5","127|B5",{"$nulls":5},"CDR",null,null,null,172,null,1,1,null,1,null,null,"020|Fb5-039|Eb2/119|Db5-138|C3",null,null,"CDR"]
["127|B5","128|E5","128, 255, 0",{"$nulls":4},"R",null,null,null,173,null,null,null,1,1,{"$nulls":5},"R"]
["029|G5","128|E5",{"$nulls":5},"CDR",null,null,null,174,null,1,1,null,1,null,null,"020|Fb5-039|Eb2/119|Db5-138|C3",null,null,"CDR"]
["128|E5","129|E5","128, 255, 0",{"$nulls":4},"E",null,null,null,175,null,null,null,1,1,{"$nulls":5},"E"]
["030|G5","129|E5",{"$nulls":5},"CDR",null,null,null,176,null,1,1,null,1,null,null,"020|Fb5-039|Eb2/119|Db5-138|C3",null,null,"CDR"]
["129|E5","130|E5","128, 255, 0",{"$nulls":8},177,null,null,null,1]
["031|G5","130|E5",{"$nulls":5},"CDR",null,null,null,178,null,1,1,null,1,null,null,"020|Fb5-039|Eb2/119|Db5-138|C3",null,null,"CDR"]
["130|E5","130|F5","128, 255, 0",{"$nulls":4},"D",null,null,null,179,null,null,null,1,1,{"$nulls":5},"D"]
["031|A5","130|F5",{"$nulls":5},"DR",null,null,null,180,null,1,1,null,1,null,null,"020|Fb5-039|Eb2/119|Db5-138|C3",null,null,"DR"]
["130|F5","131|G5","128, 255, 0",{"$nulls":4},"D",null,null,null,181,null,null,null,1,1,{"$nulls":5},"D"]
["032|B5","131|G5",{"$nulls":5},"DR",null,null,null,182,null,1,1,null,1,null,null,"020|Fb5-039|Eb2/119|Db5-138|C3",null,null,"DR"]
["131|G5","131|A5","128, 255, 0",{"$nulls":4},"CD",null,null,null,183,null,null,null,1,1,{"$nulls":5},"CD"]
["032|C6","131|A5",{"$nulls":5},"CDR",null,null,null,184,null,1,1,null,1,null,null,"020|Fb5-039|Eb2/119|Db5-138|C3",null,null,"CDR"]
["131|A5","132|C6","128, 255, 0",{"$nulls":8},185,null,null,null,1]
["033|C3","132|Ab2",{"$nulls":5},"DR",null,null,null,186,null,1,1,null,1,null,null,"020|Fb5-039|Eb2/119|Db5-138|C3",null,null,"DR"]
["132|Ab2","133|Bb2","128, 255, 0",{"$nulls":4},"DR",null,null,null,187,null,null,null,1,1,{"$nulls":5},"DR"]
["033|D6","132|C6",{"$nulls":5},"R",null,null,null,188,null,1,1,null,1,null,null,"020|Fb5-039|Eb2/119|Db5-138|C3",null,null,"R"]
["132|C6","134|C3","128, 255, 0",{"$nulls":8},189,null,null,null,1]
["034|Db3","133|Bb2",{"$nulls":5},"DR",null,null,null,190,null,1,1,null,1,null,null,"020|Fb5-039|Eb2/119|Db5-138|C3",null,null,"DR"]
["133|Bb2","134|C3","128, 255, 0",{"$nulls":4},"R",null,null,null,191,null,null,null,1,1,{"$nulls":5},"R"]
["035|Eb3","134|C3",{"$nulls":5},"DR",null,null,null,192,null,1,1,null,1,null,null,"020|Fb5-039|Eb2/119|Db5-138|C3",null,null,"DR"]
["134|C3","134|Ab3","128, 255, 0",{"$nulls":8},193,null,null,null,1]
["035|C4","134|Ab3",{"$nulls":5},"DR",null,null,null,194,null,1,1,null,1,null,null,"020|Fb5-039|Eb2/119|Db5-138|C3",null,null,"DR"]
["134|Ab3","136|Ab2","128, 255, 0",{"$nulls":8},195,null,null,null,1]
["037|C2","136|Ab2",{"$nulls":5},"DR",null,null,null,196,null,1,1,null,1,null,null,"020|Fb5-039|Eb2/119|Db5-138|C3",null,null,"DR"]
["136|Ab2","137|Bb2","128, 255, 0",{"$nulls":4},"DR",null,null,null,197,null,null,null,1,1,{"$nulls":5},"DR"]
["037|Ab5","136|C6",{"$nulls":5},"R",null,null,null,198,null,1,1,null,1,null,null,"020|Fb5-039|Eb2/119|Db5-138|C3",null,null,"R"]
["136|C6","138|C3","128, 255, 0",{"$nulls":8},199,null,null,null,1]
["038|Db2","137|Bb2",{"$nulls":5},"DR",null,null,null,200,null,1,1,null,1,null,null,"020|Fb5-039|Eb2/119|Db5-138|C3",null,null,"DR"]
["137|Bb2","138|C3","128, 255, 0",{"$nulls":4},"R",null,null,null,201,null,null,null,1,1,{"$nulls":5},"R"]
["039|Eb2","138|C3",{"$nulls":5},"DR",null,null,null,202,null,1,1,null,1,null,null,"020|Fb5-039|Eb2/119|Db5-138|C3",null,null,"DR"]
["138|C3","140|Ab4","128, 255, 0",{"$nulls":8},203,null,null,null,1]
["041|D4","140|Ab4",{"$nulls":5},"E",null,null,null,204,null,1,1,null,1,null,null,"041|D4-046|G5/140|Ab4-145|E5",null,null,"E"]
["140|Ab4","141|E4","128, 255, 0",{"$nulls":8},205,null,null,null,1]
["042|G4","141|E4",{"$nulls":5},"CDR",null,null,null,206,null,1,1,null,1,null,null,"041|D4-046|G5/140|Ab4-145|E5",null,null,"CDR"]
["141|E4","142|Ab4","128, 255, 0",{"$nulls":8},207,null,null,null,1]
["043|D4","142|Ab4",{"$nulls":5},"E",null,null,null,208,null,1,1,null,1,null,null,"041|D4-046|G5/140|Ab4-145|E5",null,null,"E"]
["142|Ab4","143|E4","128, 255, 0",{"$nulls":8},209,null,null,null,1]
["044|G4","143|E4",{"$nulls":5},"CDR",null,null,null,210,null,1,1,null,1,null,null,"041|D4-046|G5/140|Ab4-145|E5",null,null,"CDR"]
["143|E4","144|B4","128, 255, 0",{"$nulls":8},211,null,null,null,1]
["045|D5","144|B4",{"$nulls":5},"CDR",null,null,null,212,null,1,1,null,1,null,null,"041|D4-046|G5/140|Ab4-145|E5",null,null,"CDR"]
["144|B4","145|E5","128, 255, 0",{"$nulls":8},213,null,null,null,1]
["046|G5","145|E5",{"$nulls":5},"CDR",null,null,null,214,null,1,1,null,1,1,null,"041|D4-046|G5/140|Ab4-145|E5",null,null,"CDR"]
["145|E5","147|Bb5","128, 255, 0",{"$nulls":4},"E",null,null,null,215,null,1,1,1,1,1,null,null,"Y",null,"E"]
["147|Bb5","149|Ab5","128, 255, 0",2,{"$nulls":7},216,null,1,1,1,null,1,1,null,"Y","x-Developing"]
["149|Ab5","150|G5","128, 255, 0",{"$nulls":4},"CD",null,null,null,217,null,1,1,1,1,1,null,null,"Y",null,"CD"]
["150|G5","150|F5","128, 255, 0",2,{"$nulls":7},218,null,1,1,1,null,1,1,null,"Y","x-Developing"]
["000|C4","096|Eb6",{"$nulls":5},"E",null,null,null,219,{"$nulls":4},1,{"$nulls":5},"E"]
["000|C4","100|C6",{"$nulls":5},"E",null,null,null,220,{"$nulls":4},1,{"$nulls":5},"E"]
["000|C4","108|C3",{"$nulls":5},"E",null,null,null,221,{"$nulls":4},1,{"$nulls":5},"E"]
["048|Eb4","095|Ab4",{"$nulls":5},"E",null,null,null,222,{"$nulls":4},1,{"$nulls":5},"E"]
["048|Eb4","096|Eb6",{"$nulls":5},"E",null,null,null,223,{"$nulls":4},1,{"$nulls":5},"E"]
["048|Eb4","100|C6",{"$nulls":5},"E",null,null,null,224,{"$nulls":4},1,{"$nulls":5},"E"]
["003|G4","097|F4",{"$nulls":5},"E",null,null,null,225,{"$nulls":4},1,{"$nulls":5},"E"]
["003|G4","099|Eb4",{"$nulls":5},"E",null,null,null,226,{"$nulls":4},1,{"$nulls":5},"E"]
["003|G4","101|F4",{"$nulls":5},"R",null,null,null,227,{"$nulls":4},1,{"$nulls":5},"R"]
["103|G4","097|F4",{"$nulls":5},"E",null,null,null,228,{"$nulls":4},1,{"$nulls":5},"E"]
["103|G4","099|Eb4",{"$nulls":5},"E",null,null,null,229,{"$nulls":4},1,{"$nulls":5},"E"]
["101|F4","008|G2",{"$nulls":5},"E",null,null,null,230,{"$nulls":4},1,{"$nulls":5},"E"]
["101|F4","095|Ab4",{"$nulls":5},"E",null,null,null,231,{"$nulls":4},1,{"$nulls":5},"E"]
["101|F4","096|Eb6",{"$nulls":5},"E",null,null,null,232,{"$nulls":4},1,{"$nulls":5},"E"]
["101|F4","108|C3",{"$nulls":5},"E",null,null,null,233,{"$nulls":4},1,{"$nulls":5},"E"]
["004|C5","050|Db5",{"$nulls":5},"R",null,null,null,234,{"$nulls":4},1,{"$nulls":5},"R"]
["004|C5","095|Ab4",{"$nulls":5},"E",null,null,null,235,{"$nulls":4},1,{"$nulls":5},"E"]
["004|C5","096|Eb6",{"$nulls":5},"E",null,null,null,236,{"$nulls":4},1,{"$nulls":5},"E"]
["004|C5","100|C6",{"$nulls":5},"E",null,null,null,237,{"$nulls":4},1,{"$nulls":5},"E"]
["004|C5","105|C5",{"$nulls":5},"R",null,null,null,238,{"$nulls":4},1,{"$nulls":5},"R"]
["104|C5","005|C5",{"$nulls":5},"R",null,null,null,239,{"$nulls":4},1,{"$nulls":5},"R"]
["104|C5","050|Db5",{"$nulls":5},"R",null,null,null,240,{"$nulls":4},1,{"$nulls":5},"R"]
["104|C5","095|Ab4",{"$nulls":5},"E",null,null,null,241,{"$nulls":4},1,{"$nulls":5},"E"]
["104|C5","096|Eb6",{"$nulls":5},"E",null,null,null,242,{"$nulls":4},1,{"$nulls":5},"E"]
["104|C5","100|C6",{"$nulls":5},"E",null,null,null,243,{"$nulls":4},1,{"$nulls":5},"E"]
["005|C5","097|F4",{"$nulls":5},"E",null,null,null,244,{"$nulls":4},1,{"$nulls":5},"E"]
["005|C5","099|Eb4",{"$nulls":5},"E",null,null,null,245,{"$nulls":4},1,{"$nulls":5},"E"]
["105|C5","050|Db5",{"$nulls":5},"R",null,null,null,246,{"$nulls":4},1,{"$nulls":5},"R"]
["105|C5","097|F4",{"$nulls":5},"E",null,null,null,247,{"$nulls":4},1,{"$nulls":5},"E"]
["105|C5","099|Eb4",{"$nulls":5},"E",null,null,null,248,{"$nulls":4},1,{"$nulls":5},"E"]
["050|Db5","095|Ab4",{"$nulls":5},"E",null,null,null,249,{"$nulls":4},1,{"$nulls":5},"E"]
["050|Db5","096|Eb6",{"$nulls":5},"E",null,null,null,250,{"$nulls":4},1,{"$nulls":5},"E"]
["050|Db5","100|C6",{"$nulls":5},"E",null,null,null,251,{"$nulls":4},1,{"$nulls":5},"E"]
["008|G2","013|Eb5",{"$nulls":5},"E",null,null,null,252,{"$nulls":4},1,{"$nulls":5},"E"]
["008|G2","095|Ab4",{"$nulls":5},"E",null,null,null,253,{"$nulls":4},1,{"$nulls":5},"E"]
["008|G2","096|Eb6",{"$nulls":5},"E",null,null,null,254,{"$nulls":4},1,{"$nulls":5},"E"]
["008|G2","100|C6",{"$nulls":5},"E",null,null,null,255,{"$nulls":4},1,{"$nulls":5},"E"]
["108|C3","011|Eb5",{"$nulls":5},"E",null,null,null,256,{"$nulls":4},1,{"$nulls":5},"E"]
["108|C3","013|Eb5",{"$nulls":5},"E",null,null,null,257,{"$nulls":4},1,{"$nulls":5},"E"]
["108|C3","095|Ab4",{"$nulls":5},"E",null,null,null,258,{"$nulls":4},1,{"$nulls":5},"E"]
["108|C3","096|Eb6",{"$nulls":5},"E",null,null,null,259,{"$nulls":4},1,{"$nulls":5},"E"]
["108|C3","100|C6",{"$nulls":5},"E",null,null,null,260,{"$nulls":4},1,{"$nulls":5},"E"]
["011|Eb5","014|Db5",{"$nulls":5},"DR",null,null,null,261,{"$nulls":4},1,{"$nulls":5},"DR"]
["011|Eb5","095|Ab4",{"$nulls":5},"E",null,null,null,262,{"$nulls":4},1,{"$nulls":5},"E"]
["011|Eb5","096|Eb6",{"$nulls":5},"E",null,null,null,263,{"$nulls":4},1,{"$nulls":5},"E"]
["011|Eb5","100|C6",{"$nulls":5},"E",null,null,null,264,{"$nulls":4},1,{"$nulls":5},"E"]
["011|Eb5","112|Db5",{"$nulls":5},"DR",null,null,null,265,{"$nulls":4},1,{"$nulls":5},"DR"]
["011|Eb5","113|Gb5",{"$nulls":5},"DR",null,null,null,266,{"$nulls":4},1,{"$nulls":5},"DR"]
["011|Eb5","114|C5",{"$nulls":5},"DR",null,null,null,267,{"$nulls":4},1,{"$nulls":5},"DR"]
["014|Db5","098|Db6",{"$nulls":5},"E",null,null,null,268,{"$nulls":4},1,{"$nulls":5},"E"]
["014|Db5","112|Db5",{"$nulls":5},"CDR",null,null,null,269,{"$nulls":4},1,{"$nulls":5},"CDR"]
["014|Db5","113|Gb5",{"$nulls":5},"CDR",null,null,null,270,{"$nulls":4},1,{"$nulls":5},"CDR"]
["014|Db5","114|C5",{"$nulls":5},"DR",null,null,null,271,{"$nulls":4},1,{"$nulls":5},"DR"]
["112|Db5","098|Db6",{"$nulls":5},"E",null,null,null,272,{"$nulls":4},1,{"$nulls":5},"E"]
["112|Db5","113|Gb5",{"$nulls":5},"CDR",null,null,null,273,{"$nulls":4},1,{"$nulls":5},"CDR"]
["113|Gb5","012|Bb4",{"$nulls":5},"R",null,null,null,274,{"$nulls":4},1,{"$nulls":5},"R"]
["113|Gb5","098|Db6",{"$nulls":5},"E",null,null,null,275,{"$nulls":4},1,{"$nulls":5},"E"]
["114|C5","012|Bb4",{"$nulls":5},"R",null,null,null,276,{"$nulls":4},1,{"$nulls":5},"R"]
["114|C5","013|Eb5",{"$nulls":5},"E",null,null,null,277,{"$nulls":4},1,{"$nulls":5},"E"]
["114|C5","095|Ab4",{"$nulls":5},"E",null,null,null,278,{"$nulls":4},1,{"$nulls":5},"E"]
["114|C5","096|Eb6",{"$nulls":5},"E",null,null,null,279,{"$nulls":4},1,{"$nulls":5},"E"]
["114|C5","100|C6",{"$nulls":5},"E",null,null,null,280,{"$nulls":4},1,{"$nulls":5},"E"]
["012|Bb4","013|Eb5",{"$nulls":5},"E",null,null,null,281,{"$nulls":4},1,{"$nulls":5},"E"]
["012|Bb4","082|F5",{"$nulls":5},"Ex",null,null,null,282,{"$nulls":4},1,{"$nulls":5},"Ex"]
["012|Bb4","092|F6",{"$nulls":5},"Ex",null,null,null,283,{"$nulls":4},1,{"$nulls":5},"Ex"]
["012|Bb4","095|Ab4",{"$nulls":5},"E",null,null,null,284,{"$nulls":4},1,{"$nulls":5},"E"]
["012|Bb4","096|Eb6",{"$nulls":5},"E",null,null,null,285,{"$nulls":4},1,{"$nulls":5},"E"]
["012|Bb4","100|C6",{"$nulls":5},"E",null,null,null,286,{"$nulls":4},1,{"$nulls":5},"E"]
["013|Eb5","095|Ab4",{"$nulls":5},"E",null,null,null,287,{"$nulls":4},1,{"$nulls":5},"E"]
["013|Eb5","096|Eb6",{"$nulls":5},"E",null,null,null,288,{"$nulls":4},1,{"$nulls":5},"E"]
["013|Eb5","100|C6",{"$nulls":5},"E",null,null,null,289,{"$nulls":4},1,{"$nulls":5},"E"]
["013|Eb5","111|Bb5",{"$nulls":5},"E",null,null,null,290,{"$nulls":4},1,{"$nulls":5},"E"]
["015|C5","082|F5",{"$nulls":5},"Ex",null,null,null,291,{"$nulls":4},1,{"$nulls":5},"Ex"]
["015|C5","092|F6",{"$nulls":5},"Ex",null,null,null,292,{"$nulls":4},1,{"$nulls":5},"Ex"]
["016|Eb5","082|F5",{"$nulls":5},"Ex",null,null,null,293,{"$nulls":4},1,{"$nulls":5},"Ex"]
["016|Eb5","092|F6",{"$nulls":5},"Ex",null,null,null,294,{"$nulls":4},1,{"$nulls":5},"Ex"]
["018|Eb5","082|F5",{"$nulls":5},"Ex",null,null,null,295,{"$nulls":4},1,{"$nulls":5},"Ex"]
["018|Eb5","092|F6",{"$nulls":5},"Ex",null,null,null,296,{"$nulls":4},1,{"$nulls":5},"Ex"]
["020|Fb5","024|Fb5",{"$nulls":5},"E",null,null,null,297,{"$nulls":4},1,{"$nulls":5},"E"]
["020|Fb5","057|Gb5",{"$nulls":5},"CDR",null,null,null,298,{"$nulls":4},1,{"$nulls":5},"CDR"]
["020|Fb5","059|Gb5",{"$nulls":5},"E",null,null,null,299,{"$nulls":4},1,{"$nulls":5},"E"]
["020|Fb5","063|Ab5",{"$nulls":5},"CDR",null,null,null,300,{"$nulls":4},1,{"$nulls":5},"CDR"]
["020|Fb5","065|Ab5",{"$nulls":5},"CDR",null,null,null,301,{"$nulls":4},1,{"$nulls":5},"CDR"]
["020|Fb5","067|Ab3",{"$nulls":5},"CDR",null,null,null,302,{"$nulls":4},1,{"$nulls":5},"CDR"]
["020|Fb5","069|Gb3",{"$nulls":5},"CDR",null,null,null,303,{"$nulls":4},1,{"$nulls":5},"CDR"]
["020|Fb5","082|F5",{"$nulls":5},"Ex",null,null,null,304,{"$nulls":4},1,{"$nulls":5},"Ex"]
["020|Fb5","092|F6",{"$nulls":5},"Ex",null,null,null,305,{"$nulls":4},1,{"$nulls":5},"Ex"]
["020|Fb5","121|Db6",{"$nulls":5},"CDR",null,null,null,306,{"$nulls":4},1,{"$nulls":5},"CDR"]
["020|Fb5","123|Db6",{"$nulls":5},"E",null,null,null,307,{"$nulls":4},1,{"$nulls":5},"E"]
["022|Fb5","055|Gb5",{"$nulls":5},"CDR",null,null,null,308,{"$nulls":4},1,{"$nulls":5},"CDR"]
["022|Fb5","059|Gb5",{"$nulls":5},"E",null,null,null,309,{"$nulls":4},1,{"$nulls":5},"E"]
["022|Fb5","063|Ab5",{"$nulls":5},"CDR",null,null,null,310,{"$nulls":4},1,{"$nulls":5},"CDR"]
["022|Fb5","065|Ab5",{"$nulls":5},"CDR",null,null,null,311,{"$nulls":4},1,{"$nulls":5},"CDR"]
["022|Fb5","067|Ab3",{"$nulls":5},"CDR",null,null,null,312,{"$nulls":4},1,{"$nulls":5},"CDR"]
["022|Fb5","069|Gb3",{"$nulls":5},"CDR",null,null,null,313,{"$nulls":4},1,{"$nulls":5},"CDR"]
["022|Fb5","082|F5",{"$nulls":5},"Ex",null,null,null,314,{"$nulls":4},1,{"$nulls":5},"Ex"]
["022|Fb5","092|F6",{"$nulls":5},"Ex",null,null,null,315,{"$nulls":4},1,{"$nulls":5},"Ex"]
["022|Fb5","119|Db5",{"$nulls":5},"CDR",null,null,null,316,{"$nulls":4},1,{"$nulls":5},"CDR"]
["022|Fb5","123|Db6",{"$nulls":5},"E",null,null,null,317,{"$nulls":4},1,{"$nulls":5},"E"]
["055|Gb5","024|Fb5",{"$nulls":5},"E",null,null,null,318,{"$nulls":4},1,{"$nulls":5},"E"]
["055|Gb5","059|Gb5",{"$nulls":5},"E",null,null,null,319,{"$nulls":4},1,{"$nulls":5},"E"]
["055|Gb5","065|Ab5",{"$nulls":5},"CDR",null,null,null,320,{"$nulls":4},1,{"$nulls":5},"CDR"]
["055|Gb5","067|Ab3",{"$nulls":5},"CDR",null,null,null,321,{"$nulls":4},1,{"$nulls":5},"CDR"]
["055|Gb5","069|Gb3",{"$nulls":5},"CDR",null,null,null,322,{"$nulls":4},1,{"$nulls":5},"CDR"]
["055|Gb5","082|F5",{"$nulls":5},"Ex",null,null,null,323,{"$nulls":4},1,{"$nulls":5},"Ex"]
["055|Gb5","092|F6",{"$nulls":5},"Ex",null,null,null,324,{"$nulls":4},1,{"$nulls":5},"Ex"]
["055|Gb5","119|Db5",{"$nulls":5},"CDR",null,null,null,325,{"$nulls":4},1,{"$nulls":5},"CDR"]
["055|Gb5","121|Db6",{"$nulls":5},"CDR",null,null,null,326,{"$nulls":4},1,{"$nulls":5},"CDR"]
["055|Gb5","123|Db6",{"$nulls":5},"E",null,null,null,327,{"$nulls":4},1,{"$nulls":5},"E"]
["057|Gb5","024|Fb5",{"$nulls":5},"E",null,null,null,328,{"$nulls":4},1,{"$nulls":5},"E"]
["057|Gb5","063|Ab5",{"$nulls":5},"CDR",null,null,null,329,{"$nulls":4},1,{"$nulls":5},"CDR"]
["057|Gb5","067|Ab3",{"$nulls":5},"CDR",null,null,null,330,{"$nulls":4},1,{"$nulls":5},"CDR"]
["057|Gb5","069|Gb3",{"$nulls":5},"CDR",null,null,null,331,{"$nulls":4},1,{"$nulls":5},"CDR"]
["057|Gb5","082|F5",{"$nulls":5},"Ex",null,null,null,332,{"$nulls":4},1,{"$nulls":5},"Ex"]
["057|Gb5","092|F6",{"$nulls":5},"Ex",null,null,null,333,{"$nulls":4},1,{"$nulls":5},"Ex"]
["057|Gb5","119|Db5",{"$nulls":5},"CDR",null,null,null,334,{"$nulls":4},1,{"$nulls":5},"CDR"]
["057|Gb5","121|Db6",{"$nulls":5},"CDR",null,null,null,335,{"$nulls":4},1,{"$nulls":5},"CDR"]
["057|Gb5","123|Db6",{"$nulls":5},"E",null,null,null,336,{"$nulls":4},1,{"$nulls":5},"E"]
["063|Ab5","024|Fb5",{"$nulls":5},"E",null,null,null,337,{"$nulls":4},1,{"$nulls":5},"E"]
["063|Ab5","059|Gb5",{"$nulls":5},"E",null,null,null,338,{"$nulls":4},1,{"$nulls":5},"E"]
["063|Ab5","067|Ab3",{"$nulls":5},"CDR",null,null,null,339,{"$nulls":4},1,{"$nulls":5},"CDR"]
["063|Ab5","069|Gb3",{"$nulls":5},"CDR",null,null,null,340,{"$nulls":4},1,{"$nulls":5},"CDR"]
["063|Ab5","082|F5",{"$nulls":5},"Ex",null,null,null,341,{"$nulls":4},1,{"$nulls":5},"Ex"]
["063|Ab5","092|F6",{"$nulls":5},"Ex",null,null,null,342,{"$nulls":4},1,{"$nulls":5},"Ex"]
["063|Ab5","119|Db5",{"$nulls":5},"CDR",null,null,null,343,{"$nulls":4},1,{"$nulls":5},"CDR"]
["063|Ab5","121|Db6",{"$nulls":5},"CDR",null,null,null,344,{"$nulls":4},1,{"$nulls":5},"CDR"]
["063|Ab5","123|Db6",{"$nulls":5},"E",null,null,null,345,{"$nulls":4},1,{"$nulls":5},"E"]
["065|Ab5","024|Fb5",{"$nulls":5},"E",null,null,null,346,{"$nulls":4},1,{"$nulls":5},"E"]
["065|Ab5","059|Gb5",{"$nulls":5},"E",null,null,null,347,{"$nulls":4},1,{"$nulls":5},"E"]
["065|Ab5","069|Gb3",{"$nulls":5},"CDR",null,null,null,348,{"$nulls":4},1,{"$nulls":5},"CDR"]
["065|Ab5","082|F5",{"$nulls":5},"Ex",null,null,null,349,{"$nulls":4},1,{"$nulls":5},"Ex"]
["065|Ab5","092|F6",{"$nulls":5},"Ex",null,null,null,350,{"$nulls":4},1,{"$nulls":5},"Ex"]
["065|Ab5","119|Db5",{"$nulls":5},"CDR",null,null,null,351,{"$nulls":4},1,{"$nulls":5},"CDR"]
["065|Ab5","121|Db6",{"$nulls":5},"CDR",null,null,null,352,{"$nulls":4},1,{"$nulls":5},"CDR"]
["065|Ab5","123|Db6",{"$nulls":5},"E",null,null,null,353,{"$nulls":4},1,{"$nulls":5},"E"]
["067|Ab3","024|Fb5",{"$nulls":5},"E",null,null,null,354,{"$nulls":4},1,{"$nulls":5},"E"]
["067|Ab3","059|Gb5",{"$nulls":5},"E",null,null,null,355,{"$nulls":4},1,{"$nulls":5},"E"]
["067|Ab3","082|F5",{"$nulls":5},"Ex",null,null,null,356,{"$nulls":4},1,{"$nulls":5},"Ex"]
["067|Ab3","092|F6",{"$nulls":5},"Ex",null,null,null,357,{"$nulls":4},1,{"$nulls":5},"Ex"]
["067|Ab3","119|Db5",{"$nulls":5},"CDR",null,null,null,358,{"$nulls":4},1,{"$nulls":5},"CDR"]
["067|Ab3","121|Db6",{"$nulls":5},"CDR",null,null,null,359,{"$nulls":4},1,{"$nulls":5},"CDR"]
["067|Ab3","123|Db6",{"$nulls":5},"E",null,null,null,360,{"$nulls":4},1,{"$nulls":5},"E"]
["069|Gb3","024|Fb5",{"$nulls":5},"E",null,null,null,361,{"$nulls":4},1,{"$nulls":5},"E"]
["069|Gb3","059|Gb5",{"$nulls":5},"E",null,null,null,362,{"$nulls":4},1,{"$nulls":5},"E"]
["069|Gb3","082|F5",{"$nulls":5},"Ex",null,null,null,363,{"$nulls":4},1,{"$nulls":5},"Ex"]
["069|Gb3","092|F6",{"$nulls":5},"Ex",null,null,null,364,{"$nulls":4},1,{"$nulls":5},"Ex"]
["069|Gb3","119|Db5",{"$nulls":5},"CDR",null,null,null,365,{"$nulls":4},1,{"$nulls":5},"CDR"]
["069|Gb3","121|Db6",{"$nulls":5},"CDR",null,null,null,366,{"$nulls":4},1,{"$nulls":5},"CDR"]
["069|Gb3","123|Db6",{"$nulls":5},"E",null,null,null,367,{"$nulls":4},1,{"$nulls":5},"E"]
["119|Db5","024|Fb5",{"$nulls":5},"E",null,null,null,368,{"$nulls":4},1,{"$nulls":5},"E"]
["119|Db5","059|Gb5",{"$nulls":5},"E",null,null,null,369,{"$nulls":4},1,{"$nulls":5},"E"]
["119|Db5","082|F5",{"$nulls":5},"Ex",null,null,null,370,{"$nulls":4},1,{"$nulls":5},"Ex"]
["119|Db5","092|F6",{"$nulls":5},"Ex",null,null,null,371,{"$nulls":4},1,{"$nulls":5},"Ex"]
["119|Db5","123|Db6",{"$nulls":5},"E",null,null,null,372,{"$nulls":4},1,{"$nulls":5},"E"]
["121|Db6","024|Fb5",{"$nulls":5},"E",null,null,null,373,{"$nulls":4},1,{"$nulls":5},"E"]
["121|Db6","059|Gb5",{"$nulls":5},"E",null,null,null,374,{"$nulls":4},1,{"$nulls":5},"E"]
["121|Db6","082|F5",{"$nulls":5},"Ex",null,null,null,375,{"$nulls":4},1,{"$nulls":5},"Ex"]
["121|Db6","092|F6",{"$nulls":5},"Ex",null,null,null,376,{"$nulls":4},1,{"$nulls":5},"Ex"]
["024|Fb5","035|C4",{"$nulls":5},"R",null,null,null,377,{"$nulls":4},1,{"$nulls":5},"R"]
["024|Fb5","071|Fb3",{"$nulls":5},"E",null,null,null,378,{"$nulls":4},1,{"$nulls":5},"E"]
["024|Fb5","082|F5",{"$nulls":5},"Ex",null,null,null,379,{"$nulls":4},1,{"$nulls":5},"Ex"]
["024|Fb5","092|F6",{"$nulls":5},"Ex",null,null,null,380,{"$nulls":4},1,{"$nulls":5},"Ex"]
["024|Fb5","134|Ab3",{"$nulls":5},"R",null,null,null,381,{"$nulls":4},1,{"$nulls":5},"R"]
["059|Gb5","035|C4",{"$nulls":5},"R",null,null,null,382,{"$nulls":4},1,{"$nulls":5},"R"]
["059|Gb5","071|Fb3",{"$nulls":5},"E",null,null,null,383,{"$nulls":4},1,{"$nulls":5},"E"]
["059|Gb5","082|F5",{"$nulls":5},"Ex",null,null,null,384,{"$nulls":4},1,{"$nulls":5},"Ex"]
["059|Gb5","092|F6",{"$nulls":5},"Ex",null,null,null,385,{"$nulls":4},1,{"$nulls":5},"Ex"]
["059|Gb5","123|Db6",{"$nulls":5},"CDR",null,null,null,386,{"$nulls":4},1,{"$nulls":5},"CDR"]
["059|Gb5","134|Ab3",{"$nulls":5},"R",null,null,null,387,{"$nulls":4},1,{"$nulls":5},"R"]
["123|Db6","035|C4",{"$nulls":5},"R",null,null,null,388,{"$nulls":4},1,{"$nulls":5},"R"]
["123|Db6","071|Fb3",{"$nulls":5},"E",null,null,null,389,{"$nulls":4},1,{"$nulls":5},"E"]
["123|Db6","082|F5",{"$nulls":5},"Ex",null,null,null,390,{"$nulls":4},1,{"$nulls":5},"Ex"]
["123|Db6","092|F6",{"$nulls":5},"Ex",null,null,null,391,{"$nulls":4},1,{"$nulls":5},"Ex"]
["123|Db6","134|Ab3",{"$nulls":5},"R",null,null,null,392,{"$nulls":4},1,{"$nulls":5},"R"]
["026|A4","030|G5",{"$nulls":5},"R",null,null,null,393,{"$nulls":4},1,{"$nulls":5},"R"]
["026|A4","031|G5",{"$nulls":5},"CD",null,null,null,394,{"$nulls":4},1,{"$nulls":5},"CD"]
["026|A4","032|B5",{"$nulls":5},"D",null,null,null,395,{"$nulls":4},1,{"$nulls":5},"D"]
["026|A4","032|C6",{"$nulls":5},"CDR",null,null,null,396,{"$nulls":4},1,{"$nulls":5},"CDR"]
["026|A4","061|A4",{"$nulls":5},"CD",null,null,null,397,{"$nulls":4},1,{"$nulls":5},"CD"]
["026|A4","062|C5",{"$nulls":5},"CD",null,null,null,398,{"$nulls":4},1,{"$nulls":5},"CD"]
["026|A4","125|E5",{"$nulls":5},"CD",null,null,null,399,{"$nulls":4},1,{"$nulls":5},"CD"]
["026|A4","126|G5",{"$nulls":5},"CD",null,null,null,400,{"$nulls":4},1,{"$nulls":5},"CD"]
["026|A4","129|E5",{"$nulls":5},"R",null,null,null,401,{"$nulls":4},1,{"$nulls":5},"R"]
["026|A4","130|E5",{"$nulls":5},"CD",null,null,null,402,{"$nulls":4},1,{"$nulls":5},"CD"]
["026|A4","130|F5",{"$nulls":5},"DR",null,null,null,403,{"$nulls":4},1,{"$nulls":5},"DR"]
["026|A4","131|A5",{"$nulls":5},"CDR",null,null,null,404,{"$nulls":4},1,{"$nulls":5},"CDR"]
["026|A4","131|G5",{"$nulls":5},"CD",null,null,null,405,{"$nulls":4},1,{"$nulls":5},"CD"]
["031|A5","026|G4",{"$nulls":5},"CD",null,null,null,406,{"$nulls":4},1,{"$nulls":5},"CD"]
["031|A5","027|B4",{"$nulls":5},"D",null,null,null,407,{"$nulls":4},1,{"$nulls":5},"D"]
["031|A5","030|G5",{"$nulls":5},"R",null,null,null,408,{"$nulls":4},1,{"$nulls":5},"R"]
["031|A5","032|C6",{"$nulls":5},"CDR",null,null,null,409,{"$nulls":4},1,{"$nulls":5},"CDR"]
["031|A5","061|A4",{"$nulls":5},"CD",null,null,null,410,{"$nulls":4},1,{"$nulls":5},"CD"]
["031|A5","061|Bb4",{"$nulls":5},"DR",null,null,null,411,{"$nulls":4},1,{"$nulls":5},"DR"]
["031|A5","062|C5",{"$nulls":5},"CD",null,null,null,412,{"$nulls":4},1,{"$nulls":5},"CD"]
["031|A5","125|E5",{"$nulls":5},"CD",null,null,null,413,{"$nulls":4},1,{"$nulls":5},"CD"]
["031|A5","125|F5",{"$nulls":5},"DR",null,null,null,414,{"$nulls":4},1,{"$nulls":5},"DR"]
["031|A5","126|G5",{"$nulls":5},"CD",null,null,null,415,{"$nulls":4},1,{"$nulls":5},"CD"]
["031|A5","129|E5",{"$nulls":5},"R",null,null,null,416,{"$nulls":4},1,{"$nulls":5},"R"]
["031|A5","130|E5",{"$nulls":5},"CD",null,null,null,417,{"$nulls":4},1,{"$nulls":5},"CD"]
["031|A5","131|A5",{"$nulls":5},"CDR",null,null,null,418,{"$nulls":4},1,{"$nulls":5},"CDR"]
["031|A5","131|G5",{"$nulls":5},"CD",null,null,null,419,{"$nulls":4},1,{"$nulls":5},"CD"]
["032|C6","026|G4",{"$nulls":5},"CD",null,null,null,420,{"$nulls":4},1,{"$nulls":5},"CD"]
["032|C6","027|B4",{"$nulls":5},"D",null,null,null,421,{"$nulls":4},1,{"$nulls":5},"D"]
["032|C6","030|G5",{"$nulls":5},"R",null,null,null,422,{"$nulls":4},1,{"$nulls":5},"R"]
["032|C6","031|G5",{"$nulls":5},"CD",null,null,null,423,{"$nulls":4},1,{"$nulls":5},"CD"]
["032|C6","061|A4",{"$nulls":5},"CD",null,null,null,424,{"$nulls":4},1,{"$nulls":5},"CD"]
["032|C6","061|Bb4",{"$nulls":5},"DR",null,null,null,425,{"$nulls":4},1,{"$nulls":5},"DR"]
["032|C6","062|C5",{"$nulls":5},"CD",null,null,null,426,{"$nulls":4},1,{"$nulls":5},"CD"]
["032|C6","125|E5",{"$nulls":5},"CD",null,null,null,427,{"$nulls":4},1,{"$nulls":5},"CD"]
["032|C6","125|F5",{"$nulls":5},"DR",null,null,null,428,{"$nulls":4},1,{"$nulls":5},"DR"]
["032|C6","126|G5",{"$nulls":5},"CD",null,null,null,429,{"$nulls":4},1,{"$nulls":5},"CD"]
["032|C6","129|E5",{"$nulls":5},"R",null,null,null,430,{"$nulls":4},1,{"$nulls":5},"R"]
["032|C6","130|E5",{"$nulls":5},"CD",null,null,null,431,{"$nulls":4},1,{"$nulls":5},"CD"]
["032|C6","130|F5",{"$nulls":5},"DR",null,null,null,432,{"$nulls":4},1,{"$nulls":5},"DR"]
["032|C6","131|G5",{"$nulls":5},"CD",null,null,null,433,{"$nulls":4},1,{"$nulls":5},"CD"]
["131|A5","026|G4",{"$nulls":5},"CD",null,null,null,434,{"$nulls":4},1,{"$nulls":5},"CD"]
["131|A5","027|B4",{"$nulls":5},"D",null,null,null,435,{"$nulls":4},1,{"$nulls":5},"D"]
["131|A5","030|G5",{"$nulls":5},"R",null,null,null,436,{"$nulls":4},1,{"$nulls":5},"R"]
["131|A5","031|G5",{"$nulls":5},"CD",null,null,null,437,{"$nulls":4},1,{"$nulls":5},"CD"]
["131|A5","032|B5",{"$nulls":5},"D",null,null,null,438,{"$nulls":4},1,{"$nulls":5},"D"]
["131|A5","061|A4",{"$nulls":5},"CD",null,null,null,439,{"$nulls":4},1,{"$nulls":5},"CD"]
["131|A5","061|Bb4",{"$nulls":5},"DR",null,null,null,440,{"$nulls":4},1,{"$nulls":5},"DR"]
["131|A5","062|C5",{"$nulls":5},"CD",null,null,null,441,{"$nulls":4},1,{"$nulls":5},"CD"]
["131|A5","125|E5",{"$nulls":5},"CD",null,null,null,442,{"$nulls":4},1,{"$nulls":5},"CD"]
["131|A5","125|F5",{"$nulls":5},"DR",null,null,null,443,{"$nulls":4},1,{"$nulls":5},"DR"]
["131|A5","126|G5",{"$nulls":5},"CD",null,null,null,444,{"$nulls":4},1,{"$nulls":5},"CD"]
["131|A5","129|E5",{"$nulls":5},"R",null,null,null,445,{"$nulls":4},1,{"$nulls":5},"R"]
["131|A5","130|E5",{"$nulls":5},"CD",null,null,null,446,{"$nulls":4},1,{"$nulls":5},"CD"]
["131|A5","130|F5",{"$nulls":5},"DR",null,null,null,447,{"$nulls":4},1,{"$nulls":5},"DR"]
["026|G4","027|B4",{"$nulls":5},"DR",null,null,null,448,{"$nulls":4},1,{"$nulls":5},"DR"]
["026|G4","032|B5",{"$nulls":5},"DR",null,null,null,449,{"$nulls":4},1,{"$nulls":5},"DR"]
["026|G4","033|D6",{"$nulls":5},"E",null,null,null,450,{"$nulls":4},1,{"$nulls":5},"E"]
["026|G4","061|Bb4",{"$nulls":5},"D",null,null,null,451,{"$nulls":4},1,{"$nulls":5},"D"]
["026|G4","062|C5",{"$nulls":5},"CDR",null,null,null,452,{"$nulls":4},1,{"$nulls":5},"CDR"]
["026|G4","125|F5",{"$nulls":5},"D",null,null,null,453,{"$nulls":4},1,{"$nulls":5},"D"]
["026|G4","126|G5",{"$nulls":5},"CDR",null,null,null,454,{"$nulls":4},1,{"$nulls":5},"CDR"]
["026|G4","130|E5",{"$nulls":5},"CDR",null,null,null,455,{"$nulls":4},1,{"$nulls":5},"CDR"]
["026|G4","130|F5",{"$nulls":5},"D",null,null,null,456,{"$nulls":4},1,{"$nulls":5},"D"]
["026|G4","131|G5",{"$nulls":5},"CDR",null,null,null,457,{"$nulls":4},1,{"$nulls":5},"CDR"]
["031|G5","027|B4",{"$nulls":5},"DR",null,null,null,458,{"$nulls":4},1,{"$nulls":5},"DR"]
["031|G5","032|B5",{"$nulls":5},"DR",null,null,null,459,{"$nulls":4},1,{"$nulls":5},"DR"]
["031|G5","033|D6",{"$nulls":5},"E",null,null,null,460,{"$nulls":4},1,{"$nulls":5},"E"]
["031|G5","061|A4",{"$nulls":5},"CDR",null,null,null,461,{"$nulls":4},1,{"$nulls":5},"CDR"]
["031|G5","061|Bb4",{"$nulls":5},"D",null,null,null,462,{"$nulls":4},1,{"$nulls":5},"D"]
["031|G5","062|C5",{"$nulls":5},"CDR",null,null,null,463,{"$nulls":4},1,{"$nulls":5},"CDR"]
["031|G5","125|E5",{"$nulls":5},"CDR",null,null,null,464,{"$nulls":4},1,{"$nulls":5},"CDR"]
["031|G5","125|F5",{"$nulls":5},"D",null,null,null,465,{"$nulls":4},1,{"$nulls":5},"D"]
["031|G5","126|G5",{"$nulls":5},"CDR",null,null,null,466,{"$nulls":4},1,{"$nulls":5},"CDR"]
["031|G5","130|F5",{"$nulls":5},"D",null,null,null,467,{"$nulls":4},1,{"$nulls":5},"D"]
["031|G5","131|G5",{"$nulls":5},"CDR",null,null,null,468,{"$nulls":4},1,{"$nulls":5},"CDR"]
["061|A4","027|B4",{"$nulls":5},"DR",null,null,null,469,{"$nulls":4},1,{"$nulls":5},"DR"]
["061|A4","032|B5",{"$nulls":5},"DR",null,null,null,470,{"$nulls":4},1,{"$nulls":5},"DR"]
["061|A4","033|D6",{"$nulls":5},"E",null,null,null,471,{"$nulls":4},1,{"$nulls":5},"E"]
["061|A4","062|C5",{"$nulls":5},"CDR",null,null,null,472,{"$nulls":4},1,{"$nulls":5},"CDR"]
["061|A4","125|E5",{"$nulls":5},"CDR",null,null,null,473,{"$nulls":4},1,{"$nulls":5},"CDR"]
["061|A4","125|F5",{"$nulls":5},"D",null,null,null,474,{"$nulls":4},1,{"$nulls":5},"D"]
["061|A4","126|G5",{"$nulls":5},"CDR",null,null,null,475,{"$nulls":4},1,{"$nulls":5},"CDR"]
["061|A4","130|E5",{"$nulls":5},"CDR",null,null,null,476,{"$nulls":4},1,{"$nulls":5},"CDR"]
["061|A4","130|F5",{"$nulls":5},"D",null,null,null,477,{"$nulls":4},1,{"$nulls":5},"D"]
["061|A4","131|G5",{"$nulls":5},"CDR",null,null,null,478,{"$nulls":4},1,{"$nulls":5},"CDR"]
["062|C5","032|B5",{"$nulls":5},"DR",null,null,null,479,{"$nulls":4},1,{"$nulls":5},"DR"]
["062|C5","033|D6",{"$nulls":5},"E",null,null,null,480,{"$nulls":4},1,{"$nulls":5},"E"]
["062|C5","125|E5",{"$nulls":5},"CDR",null,null,null,481,{"$nulls":4},1,{"$nulls":5},"CDR"]
["062|C5","125|F5",{"$nulls":5},"D",null,null,null,482,{"$nulls":4},1,{"$nulls":5},"D"]
["062|C5","126|G5",{"$nulls":5},"CDR",null,null,null,483,{"$nulls":4},1,{"$nulls":5},"CDR"]
["062|C5","130|E5",{"$nulls":5},"CDR",null,null,null,484,{"$nulls":4},1,{"$nulls":5},"CDR"]
["062|C5","130|F5",{"$nulls":5},"D",null,null,null,485,{"$nulls":4},1,{"$nulls":5},"D"]
["062|C5","131|G5",{"$nulls":5},"CDR",null,null,null,486,{"$nulls":4},1,{"$nulls":5},"CDR"]
["125|E5","027|B4",{"$nulls":5},"DR",null,null,null,487,{"$nulls":4},1,{"$nulls":5},"DR"]
["125|E5","032|B5",{"$nulls":5},"DR",null,null,null,488,{"$nulls":4},1,{"$nulls":5},"DR"]
["125|E5","033|D6",{"$nulls":5},"E",null,null,null,489,{"$nulls":4},1,{"$nulls":5},"E"]
["125|E5","061|Bb4",{"$nulls":5},"D",null,null,null,490,{"$nulls":4},1,{"$nulls":5},"D"]
["125|E5","126|G5",{"$nulls":5},"CDR",null,null,null,491,{"$nulls":4},1,{"$nulls":5},"CDR"]
["125|E5","130|E5",{"$nulls":5},"CDR",null,null,null,492,{"$nulls":4},1,{"$nulls":5},"CDR"]
["125|E5","130|F5",{"$nulls":5},"D",null,null,null,493,{"$nulls":4},1,{"$nulls":5},"D"]
["125|E5","131|G5",{"$nulls":5},"CDR",null,null,null,494,{"$nulls":4},1,{"$nulls":5},"CDR"]
["126|G5","032|B5",{"$nulls":5},"DR",null,null,null,495,{"$nulls":4},1,{"$nulls":5},"DR"]
["126|G5","033|D6",{"$nulls":5},"E",null,null,null,496,{"$nulls":4},1,{"$nulls":5},"E"]
["126|G5","061|Bb4",{"$nulls":5},"D",null,null,null,497,{"$nulls":4},1,{"$nulls":5},"D"]
["126|G5","130|E5",{"$nulls":5},"CDR",null,null,null,498,{"$nulls":4},1,{"$nulls":5},"CDR"]
["126|G5","130|F5",{"$nulls":5},"D",null,null,null,499,{"$nulls":4},1,{"$nulls":5},"D"]
["126|G5","131|G5",{"$nulls":5},"CDR",null,null,null,500,{"$nulls":4},1,{"$nulls":5},"CDR"]
["130|E5","027|B4",{"$nulls":5},"DR",null,null,null,501,{"$nulls":4},1,{"$nulls":5},"DR"]
["130|E5","032|B5",{"$nulls":5},"DR",null,null,null,502,{"$nulls":4},1,{"$nulls":5},"DR"]
["130|E5","033|D6",{"$nulls":5},"E",null,null,null,503,{"$nulls":4},1,{"$nulls":5},"E"]
["130|E5","061|Bb4",{"$nulls":5},"D",null,null,null,504,{"$nulls":4},1,{"$nulls":5},"D"]
["130|E5","125|F5",{"$nulls":5},"D",null,null,null,505,{"$nulls":4},1,{"$nulls":5},"D"]
["130|E5","131|G5",{"$nulls":5},"CDR",null,null,null,506,{"$nulls":4},1,{"$nulls":5},"CDR"]
["131|G5","027|B4",{"$nulls":5},"DR",null,null,null,507,{"$nulls":4},1,{"$nulls":5},"DR"]
["131|G5","033|D6",{"$nulls":5},"E",null,null,null,508,{"$nulls":4},1,{"$nulls":5},"E"]
["131|G5","061|Bb4",{"$nulls":5},"D",null,null,null,509,{"$nulls":4},1,{"$nulls":5},"D"]
["131|G5","125|F5",{"$nulls":5},"D",null,null,null,510,{"$nulls":4},1,{"$nulls":5},"D"]
["061|Bb4","027|B4",{"$nulls":5},"D",null,null,null,511,{"$nulls":4},1,{"$nulls":5},"D"]
["061|Bb4","030|G5",{"$nulls":5},"R",null,null,null,512,{"$nulls":4},1,{"$nulls":5},"R"]
["061|Bb4","032|B5",{"$nulls":5},"D",null,null,null,513,{"$nulls":4},1,{"$nulls":5},"D"]
["061|Bb4","125|F5",{"$nulls":5},"CDR",null,null,null,514,{"$nulls":4},1,{"$nulls":5},"CDR"]
["061|Bb4","129|E5",{"$nulls":5},"R",null,null,null,515,{"$nulls":4},1,{"$nulls":5},"R"]
["061|Bb4","130|F5",{"$nulls":5},"CDR",null,null,null,516,{"$nulls":4},1,{"$nulls":5},"CDR"]
["125|F5","027|B4",{"$nulls":5},"D",null,null,null,517,{"$nulls":4},1,{"$nulls":5},"D"]
["125|F5","030|G5",{"$nulls":5},"R",null,null,null,518,{"$nulls":4},1,{"$nulls":5},"R"]
["125|F5","032|B5",{"$nulls":5},"D",null,null,null,519,{"$nulls":4},1,{"$nulls":5},"D"]
["125|F5","129|E5",{"$nulls":5},"R",null,null,null,520,{"$nulls":4},1,{"$nulls":5},"R"]
["125|F5","130|F5",{"$nulls":5},"CDR",null,null,null,521,{"$nulls":4},1,{"$nulls":5},"CDR"]
["130|F5","027|B4",{"$nulls":5},"D",null,null,null,522,{"$nulls":4},1,{"$nulls":5},"D"]
["130|F5","030|G5",{"$nulls":5},"R",null,null,null,523,{"$nulls":4},1,{"$nulls":5},"R"]
["130|F5","032|B5",{"$nulls":5},"D",null,null,null,524,{"$nulls":4},1,{"$nulls":5},"D"]
["130|F5","129|E5",{"$nulls":5},"R",null,null,null,525,{"$nulls":4},1,{"$nulls":5},"R"]
["030|G5","128|E5",{"$nulls":5},"E",null,null,null,526,{"$nulls":4},1,{"$nulls":5},"E"]
["129|E5","029|G5",{"$nulls":5},"E",null,null,null,527,{"$nulls":4},1,{"$nulls":5},"E"]
["027|D5","029|G5",{"$nulls":5},"R",null,null,null,528,{"$nulls":4},1,{"$nulls":5},"R"]
["027|D5","127|B5",{"$nulls":5},"CDR",null,null,null,529,{"$nulls":4},1,{"$nulls":5},"CDR"]
["027|D5","128|E5",{"$nulls":5},"R",null,null,null,530,{"$nulls":4},1,{"$nulls":5},"R"]
["028|D5","062|B4",{"$nulls":5},"R",null,null,null,531,{"$nulls":4},1,{"$nulls":5},"R"]
["028|D5","126|B5",{"$nulls":5},"CDR",null,null,null,532,{"$nulls":4},1,{"$nulls":5},"CDR"]
["028|D5","128|E5",{"$nulls":5},"R",null,null,null,533,{"$nulls":4},1,{"$nulls":5},"R"]
["126|B5","029|G5",{"$nulls":5},"R",null,null,null,534,{"$nulls":4},1,{"$nulls":5},"R"]
["126|B5","062|B4",{"$nulls":5},"R",null,null,null,535,{"$nulls":4},1,{"$nulls":5},"R"]
["126|B5","128|E5",{"$nulls":5},"R",null,null,null,536,{"$nulls":4},1,{"$nulls":5},"R"]
["127|B5","029|G5",{"$nulls":5},"R",null,null,null,537,{"$nulls":4},1,{"$nulls":5},"R"]
["127|B5","062|B4",{"$nulls":5},"R",null,null,null,538,{"$nulls":4},1,{"$nulls":5},"R"]
["029|G5","062|B4",{"$nulls":5},"R",null,null,null,539,{"$nulls":4},1,{"$nulls":5},"R"]
["128|E5","062|B4",{"$nulls":5},"R",null,null,null,540,{"$nulls":4},1,{"$nulls":5},"R"]
["033|C3","035|Eb3",{"$nulls":5},"R",null,null,null,541,{"$nulls":4},1,{"$nulls":5},"R"]
["033|C3","038|Db2",{"$nulls":5},"DR",null,null,null,542,{"$nulls":4},1,{"$nulls":5},"DR"]
["033|C3","039|Eb2",{"$nulls":5},"R",null,null,null,543,{"$nulls":4},1,{"$nulls":5},"R"]
["033|C3","133|Bb2",{"$nulls":5},"DR",null,null,null,544,{"$nulls":4},1,{"$nulls":5},"DR"]
["033|C3","134|C3",{"$nulls":5},"R",null,null,null,545,{"$nulls":4},1,{"$nulls":5},"R"]
["033|C3","136|Ab2",{"$nulls":5},"DR",null,null,null,546,{"$nulls":4},1,{"$nulls":5},"DR"]
["033|C3","137|Bb2",{"$nulls":5},"DR",null,null,null,547,{"$nulls":4},1,{"$nulls":5},"DR"]
["033|C3","138|C3",{"$nulls":5},"R",null,null,null,548,{"$nulls":4},1,{"$nulls":5},"R"]
["037|C2","034|Db3",{"$nulls":5},"DR",null,null,null,549,{"$nulls":4},1,{"$nulls":5},"DR"]
["037|C2","035|Eb3",{"$nulls":5},"R",null,null,null,550,{"$nulls":4},1,{"$nulls":5},"R"]
["037|C2","039|Eb2",{"$nulls":5},"R",null,null,null,551,{"$nulls":4},1,{"$nulls":5},"R"]
["037|C2","132|Ab2",{"$nulls":5},"DR",null,null,null,552,{"$nulls":4},1,{"$nulls":5},"DR"]
["037|C2","133|Bb2",{"$nulls":5},"DR",null,null,null,553,{"$nulls":4},1,{"$nulls":5},"DR"]
["037|C2","134|C3",{"$nulls":5},"R",null,null,null,554,{"$nulls":4},1,{"$nulls":5},"R"]
["037|C2","137|Bb2",{"$nulls":5},"DR",null,null,null,555,{"$nulls":4},1,{"$nulls":5},"DR"]
["037|C2","138|C3",{"$nulls":5},"R",null,null,null,556,{"$nulls":4},1,{"$nulls":5},"R"]
["034|Db3","039|Eb2",{"$nulls":5},"R",null,null,null,557,{"$nulls":4},1,{"$nulls":5},"R"]
["034|Db3","132|Ab2",{"$nulls":5},"CDR",null,null,null,558,{"$nulls":4},1,{"$nulls":5},"CDR"]
["034|Db3","134|C3",{"$nulls":5},"R",null,null,null,559,{"$nulls":4},1,{"$nulls":5},"R"]
["034|Db3","136|Ab2",{"$nulls":5},"CDR",null,null,null,560,{"$nulls":4},1,{"$nulls":5},"CDR"]
["034|Db3","137|Bb2",{"$nulls":5},"DR",null,null,null,561,{"$nulls":4},1,{"$nulls":5},"DR"]
["034|Db3","138|C3",{"$nulls":5},"R",null,null,null,562,{"$nulls":4},1,{"$nulls":5},"R"]
["038|Db2","035|Eb3",{"$nulls":5},"R",null,null,null,563,{"$nulls":4},1,{"$nulls":5},"R"]
["038|Db2","132|Ab2",{"$nulls":5},"CDR",null,null,null,564,{"$nulls":4},1,{"$nulls":5},"CDR"]
["038|Db2","133|Bb2",{"$nulls":5},"DR",null,null,null,565,{"$nulls":4},1,{"$nulls":5},"DR"]
["038|Db2","134|C3",{"$nulls":5},"R",null,null,null,566,{"$nulls":4},1,{"$nulls":5},"R"]
["038|Db2","136|Ab2",{"$nulls":5},"CDR",null,null,null,567,{"$nulls":4},1,{"$nulls":5},"CDR"]
["038|Db2","138|C3",{"$nulls":5},"R",null,null,null,568,{"$nulls":4},1,{"$nulls":5},"R"]
["132|Ab2","035|Eb3",{"$nulls":5},"R",null,null,null,569,{"$nulls":4},1,{"$nulls":5},"R"]
["132|Ab2","039|Eb2",{"$nulls":5},"R",null,null,null,570,{"$nulls":4},1,{"$nulls":5},"R"]
["132|Ab2","134|C3",{"$nulls":5},"R",null,null,null,571,{"$nulls":4},1,{"$nulls":5},"R"]
["132|Ab2","136|Ab2",{"$nulls":5},"CDR",null,null,null,572,{"$nulls":4},1,{"$nulls":5},"CDR"]
["132|Ab2","137|Bb2",{"$nulls":5},"DR",null,null,null,573,{"$nulls":4},1,{"$nulls":5},"DR"]
["132|Ab2","138|C3",{"$nulls":5},"R",null,null,null,574,{"$nulls":4},1,{"$nulls":5},"R"]
["136|Ab2","035|Eb3",{"$nulls":5},"R",null,null,null,575,{"$nulls":4},1,{"$nulls":5},"R"]
["136|Ab2","039|Eb2",{"$nulls":5},"R",null,null,null,576,{"$nulls":4},1,{"$nulls":5},"R"]
["136|Ab2","133|Bb2",{"$nulls":5},"DR",null,null,null,577,{"$nulls":4},1,{"$nulls":5},"DR"]
["136|Ab2","134|C3",{"$nulls":5},"R",null,null,null,578,{"$nulls":4},1,{"$nulls":5},"R"]
["136|Ab2","138|C3",{"$nulls":5},"R",null,null,null,579,{"$nulls":4},1,{"$nulls":5},"R"]
["133|Bb2","035|Eb3",{"$nulls":5},"R",null,null,null,580,{"$nulls":4},1,{"$nulls":5},"R"]
["133|Bb2","039|Eb2",{"$nulls":5},"R",null,null,null,581,{"$nulls":4},1,{"$nulls":5},"R"]
["133|Bb2","137|Bb2",{"$nulls":5},"CDR",null,null,null,582,{"$nulls":4},1,{"$nulls":5},"CDR"]
["133|Bb2","138|C3",{"$nulls":5},"R",null,null,null,583,{"$nulls":4},1,{"$nulls":5},"R"]
["137|Bb2","035|Eb3",{"$nulls":5},"R",null,null,null,584,{"$nulls":4},1,{"$nulls":5},"R"]
["137|Bb2","039|Eb2",{"$nulls":5},"R",null,null,null,585,{"$nulls":4},1,{"$nulls":5},"R"]
["137|Bb2","134|C3",{"$nulls":5},"R",null,null,null,586,{"$nulls":4},1,{"$nulls":5},"R"]
["035|Eb3","138|C3",{"$nulls":5},"DR",null,null,null,587,{"$nulls":4},1,{"$nulls":5},"DR"]
["039|Eb2","134|C3",{"$nulls":5},"DR",null,null,null,588,{"$nulls":4},1,{"$nulls":5},"DR"]
["134|C3","138|C3",{"$nulls":5},"CDR",null,null,null,589,{"$nulls":4},1,{"$nulls":5},"CDR"]
["033|D6","136|C6",{"$nulls":5},"R",null,null,null,590,{"$nulls":4},1,{"$nulls":5},"R"]
["037|Ab5","132|C6",{"$nulls":5},"R",null,null,null,591,{"$nulls":4},1,{"$nulls":5},"R"]
["132|C6","136|C6",{"$nulls":5},"CDR",null,null,null,592,{"$nulls":4},1,{"$nulls":5},"CDR"]
["041|D4","045|D5",{"$nulls":5},"CDR",null,null,null,593,{"$nulls":4},1,{"$nulls":5},"CDR"]
["041|D4","142|Ab4",{"$nulls":5},"E",null,null,null,594,{"$nulls":4},1,{"$nulls":5},"E"]
["041|D4","144|B4",{"$nulls":5},"CDR",null,null,null,595,{"$nulls":4},1,{"$nulls":5},"CDR"]
["043|D4","140|Ab4",{"$nulls":5},"E",null,null,null,596,{"$nulls":4},1,{"$nulls":5},"E"]
["043|D4","144|B4",{"$nulls":5},"CDR",null,null,null,597,{"$nulls":4},1,{"$nulls":5},"CDR"]
["045|D5","140|Ab4",{"$nulls":5},"E",null,null,null,598,{"$nulls":4},1,{"$nulls":5},"E"]
["045|D5","142|Ab4",{"$nulls":5},"E",null,null,null,599,{"$nulls":4},1,{"$nulls":5},"E"]
["144|B4","140|Ab4",{"$nulls":5},"E",null,null,null,600,{"$nulls":4},1,{"$nulls":5},"E"]
["144|B4","142|Ab4",{"$nulls":5},"E",null,null,null,601,{"$nulls":4},1,{"$nulls":5},"E"]
["042|G4","046|G5",{"$nulls":5},"CD",null,null,null,602,{"$nulls":4},1,{"$nulls":5},"CD"]
["042|G4","143|E4",{"$nulls":5},"CDR",null,null,null,603,{"$nulls":4},1,{"$nulls":5},"CDR"]
["042|G4","145|E5",{"$nulls":5},"CD",null,null,null,604,{"$nulls":4},1,{"$nulls":5},"CD"]
["044|G4","141|E4",{"$nulls":5},"CDR",null,null,null,605,{"$nulls":4},1,{"$nulls":5},"CDR"]
["044|G4","145|E5",{"$nulls":5},"CD",null,null,null,606,{"$nulls":4},1,{"$nulls":5},"CD"]
["141|E4","046|G5",{"$nulls":5},"CD",null,null,null,607,{"$nulls":4},1,{"$nulls":5},"CD"]
["141|E4","143|E4",{"$nulls":5},"CDR",null,null,null,608,{"$nulls":4},1,{"$nulls":5},"CDR"]
["141|E4","145|E5",{"$nulls":5},"CD",null,null,null,609,{"$nulls":4},1,{"$nulls":5},"CD"]
["143|E4","046|G5",{"$nulls":5},"CD",null,null,null,610,{"$nulls":4},1,{"$nulls":5},"CD"]
["143|E4","145|E5",{"$nulls":5},"CD",null,null,null,611,{"$nulls":4},1,{"$nulls":5},"CD"]
["046|G5","147|Bb5",{"$nulls":5},"E",null,null,null,612,{"$nulls":4},1,{"$nulls":5},"E"]
["052|Bb4","095|Ab4",{"$nulls":5},"E",null,null,null,613,{"$nulls":4},1,{"$nulls":5},"E"]
["052|Bb4","096|Eb6",{"$nulls":5},"E",null,null,null,614,{"$nulls":4},1,{"$nulls":5},"E"]
["052|Bb4","100|C6",{"$nulls":5},"E",null,null,null,615,{"$nulls":4},1,{"$nulls":5},"E"]
["053|Db5","084|F6",{"$nulls":5},"Ex",null,null,null,616,{"$nulls":4},1,{"$nulls":5},"Ex"]
["053|Db5","095|Ab4",{"$nulls":5},"E",null,null,null,617,{"$nulls":4},1,{"$nulls":5},"E"]
["053|Db5","096|Eb6",{"$nulls":5},"E",null,null,null,618,{"$nulls":4},1,{"$nulls":5},"E"]
["053|Db5","100|C6",{"$nulls":5},"E",null,null,null,619,{"$nulls":4},1,{"$nulls":5},"E"]
["069|B4","073|G4",{"$nulls":5},"CD",null,null,null,620,{"$nulls":4},1,{"$nulls":5},"CD"]
["069|B4","075|F4",{"$nulls":5},"D",null,null,null,621,{"$nulls":4},1,{"$nulls":5},"D"]
["069|B4","077|E4",{"$nulls":5},"CD",null,null,null,622,{"$nulls":4},1,{"$nulls":5},"CD"]
["069|B4","115|G5",{"$nulls":5},"Ex",null,null,null,623,{"$nulls":4},1,{"$nulls":5},"Ex"]
["069|B4","117|E5",{"$nulls":5},"Ex",null,null,null,624,{"$nulls":4},1,{"$nulls":5},"Ex"]
["069|B4","150|G5",{"$nulls":5},"Rx",null,null,null,625,{"$nulls":4},1,{"$nulls":5},"Rx"]
["071|A4","075|F4",{"$nulls":5},"D",null,null,null,626,{"$nulls":4},1,{"$nulls":5},"D"]
["071|A4","077|E4",{"$nulls":5},"CD",null,null,null,627,{"$nulls":4},1,{"$nulls":5},"CD"]
["071|A4","115|G5",{"$nulls":5},"Ex",null,null,null,628,{"$nulls":4},1,{"$nulls":5},"Ex"]
["071|A4","117|E5",{"$nulls":5},"Ex",null,null,null,629,{"$nulls":4},1,{"$nulls":5},"Ex"]
["071|A4","150|G5",{"$nulls":5},"Rx",null,null,null,630,{"$nulls":4},1,{"$nulls":5},"Rx"]
["073|G4","077|E4",{"$nulls":5},"CDR",null,null,null,631,{"$nulls":4},1,{"$nulls":5},"CDR"]
["150|G5","083|C6",{"$nulls":5},"CDx",null,null,null,632,{"$nulls":4},1,{"$nulls":5},"CDx"]
["083|C6","081|C5",{"$nulls":5},"R",null,null,null,633,{"$nulls":4},1,{"$nulls":5},"R"]
["083|C6","092|F6",{"$nulls":5},"R",null,null,null,634,{"$nulls":4},1,{"$nulls":5},"R"]
["083|C6","149|Ab5",{"$nulls":5},"CDRx",null,null,null,635,{"$nulls":4},1,{"$nulls":5},"CDRx"]
["149|Ab5","081|C5",{"$nulls":5},"Rx",null,null,null,636,{"$nulls":4},1,{"$nulls":5},"Rx"]
["149|Ab5","082|F5",{"$nulls":5},"Rx",null,null,null,637,{"$nulls":4},1,{"$nulls":5},"Rx"]
["149|Ab5","087|C6",{"$nulls":5},"Ex",null,null,null,638,{"$nulls":4},1,{"$nulls":5},"Ex"]
["149|Ab5","092|F6",{"$nulls":5},"Rx",null,null,null,639,{"$nulls":4},1,{"$nulls":5},"Rx"]
["081|C5","092|F6",{"$nulls":5},"R",null,null,null,640,{"$nulls":4},1,{"$nulls":5},"R"]
["082|F5","071|Fb3",{"$nulls":5},"Ex",null,null,null,641,{"$nulls":4},1,{"$nulls":5},"Ex"]
["082|F5","084|F6",{"$nulls":5},"CD",null,null,null,642,{"$nulls":4},1,{"$nulls":5},"CD"]
["082|F5","088|F6",{"$nulls":5},"E",null,null,null,643,{"$nulls":4},1,{"$nulls":5},"E"]
["082|F5","089|Db6",{"$nulls":5},"E",null,null,null,644,{"$nulls":4},1,{"$nulls":5},"E"]
["082|F5","090|F6",{"$nulls":5},"E",null,null,null,645,{"$nulls":4},1,{"$nulls":5},"E"]
["082|F5","091|Db6",{"$nulls":5},"E",null,null,null,646,{"$nulls":4},1,{"$nulls":5},"E"]
["082|F5","092|F6",{"$nulls":5},"CDR",null,null,null,647,{"$nulls":4},1,{"$nulls":5},"CDR"]
["092|F6","071|Fb3",{"$nulls":5},"Ex",null,null,null,648,{"$nulls":4},1,{"$nulls":5},"Ex"]
["092|F6","084|F6",{"$nulls":5},"CD",null,null,null,649,{"$nulls":4},1,{"$nulls":5},"CD"]
["092|F6","086|F5",{"$nulls":5},"E",null,null,null,650,{"$nulls":4},1,{"$nulls":5},"E"]
["092|F6","088|F6",{"$nulls":5},"E",null,null,null,651,{"$nulls":4},1,{"$nulls":5},"E"]
["092|F6","089|Db6",{"$nulls":5},"E",null,null,null,652,{"$nulls":4},1,{"$nulls":5},"E"]
["085|C5","087|C6",{"$nulls":5},"R",null,null,null,653,{"$nulls":4},1,{"$nulls":5},"R"]
["085|C5","088|F6",{"$nulls":5},"R",null,null,null,654,{"$nulls":4},1,{"$nulls":5},"R"]
["085|C5","089|Db6",{"$nulls":5},"R",null,null,null,655,{"$nulls":4},1,{"$nulls":5},"R"]
["085|C5","090|F6",{"$nulls":5},"R",null,null,null,656,{"$nulls":4},1,{"$nulls":5},"R"]
["085|C5","091|Db6",{"$nulls":5},"R",null,null,null,657,{"$nulls":4},1,{"$nulls":5},"R"]
["086|F5","088|F6",{"$nulls":5},"CDR",null,null,null,658,{"$nulls":4},1,{"$nulls":5},"CDR"]
["086|F5","089|Db6",{"$nulls":5},"CDR",null,null,null,659,{"$nulls":4},1,{"$nulls":5},"CDR"]
["086|F5","090|F6",{"$nulls":5},"CDR",null,null,null,660,{"$nulls":4},1,{"$nulls":5},"CDR"]
["086|F5","091|Db6",{"$nulls":5},"CDR",null,null,null,661,{"$nulls":4},1,{"$nulls":5},"CDR"]
["088|F6","091|Db6",{"$nulls":5},"CDR",null,null,null,662,{"$nulls":4},1,{"$nulls":5},"CDR"]
["089|Db6","087|C6",{"$nulls":5},"R",null,null,null,663,{"$nulls":4},1,{"$nulls":5},"R"]
["090|F6","087|C6",{"$nulls":5},"R",null,null,null,664,{"$nulls":4},1,{"$nulls":5},"R"]
["091|Db6","087|C6",{"$nulls":5},"R",null,null,null,665,{"$nulls":4},1,{"$nulls":5},"R"]
["095|Ab4","098|Db6",{"$nulls":5},"DR",null,null,null,666,{"$nulls":4},1,{"$nulls":5},"DR"]
["095|Ab4","099|Eb4",{"$nulls":5},"DR",null,null,null,667,{"$nulls":4},1,{"$nulls":5},"DR"]
["095|Ab4","100|C6",{"$nulls":5},"CDR",null,null,null,668,{"$nulls":4},1,{"$nulls":5},"CDR"]
["095|Ab4","111|Bb5",{"$nulls":5},"E",null,null,null,669,{"$nulls":4},1,{"$nulls":5},"E"]
["095|Ab4","115|G5",{"$nulls":5},"E",null,null,null,670,{"$nulls":4},1,{"$nulls":5},"E"]
["096|Eb6","099|Eb4",{"$nulls":5},"DR",null,null,null,671,{"$nulls":4},1,{"$nulls":5},"DR"]
["096|Eb6","100|C6",{"$nulls":5},"CDR",null,null,null,672,{"$nulls":4},1,{"$nulls":5},"CDR"]
["096|Eb6","111|Bb5",{"$nulls":5},"E",null,null,null,673,{"$nulls":4},1,{"$nulls":5},"E"]
["096|Eb6","115|G5",{"$nulls":5},"E",null,null,null,674,{"$nulls":4},1,{"$nulls":5},"E"]
["100|C6","097|F4",{"$nulls":5},"DR",null,null,null,675,{"$nulls":4},1,{"$nulls":5},"DR"]
["100|C6","111|Bb5",{"$nulls":5},"E",null,null,null,676,{"$nulls":4},1,{"$nulls":5},"E"]
["100|C6","115|G5",{"$nulls":5},"E",null,null,null,677,{"$nulls":4},1,{"$nulls":5},"E"]
["140|Ab4","142|Ab4",{"$nulls":5},"CDR",null,null,null,678,{"$nulls":4},1,{"$nulls":5},"CDR"]

{"sheet":"Do Not Delete","index":5,"n_rows":3,"n_cols":1,"rows_kept":3,"cut":false,"hidden":true,"merged":[]}
["This worksheet is no longer used but is retained to allow older versions of NodeXL to open workbooks created with NodeXL version 1.0.1.96 or later."]
[]
["Do not delete this worksheet."]

{"sheet":"Family Distribution","index":6,"n_rows":21,"n_cols":53,"rows_kept":21,"cut":false,"hidden":false,"merged":[[0,49,0,50],[7,7,7,8],[7,32,7,33],[7,52,7,53],[14,8,14,9],[14,19,14,20],[14,31,14,32],[14,52,14,53],[6,7,6,8],[12,8,12,9],[12,19,12,20],[4,7,4,8],[4,32,4,33],[8,19,8,20],[8,31,8,32],[77,163,77,164],[154,48,154,49],[154,62,154,63],[154,79,154,80],[154,88,154,89],[81,163,81,164],[0,114,0,115],[0,127,0,128],[198,55,198,56],[198,73,198,74],[198,127,198,128],[77,55,77,56],[77,73,77,74],[77,127,77,128],[81,127,81,128],[594,70,594,71],[594,108,594,109],[0,5,0,6],[0,56,0,57],[0,76,0,77],[231,70,231,71],[231,108,231,109],[81,55,81,56],[81,73,81,74],[162,48,162,49],[162,62,162,63],[162,79,162,80],[162,88,162,89],[0,9,0,10],[0,21,0,22],[0,33,0,34],[198,163,198,164],[396,48,396,49],[396,62,396,63],[396,79,396,80],[396,88,396,89],[243,70,243,71],[243,108,243,109]]}
[{"$nulls":9},"b.9",{"$nulls":11},"b.21",{"$nulls":11},"b.33",{"$nulls":15},"b.49"]
["Exposition","1st subject",{"$nulls":8},"Bridge",{"$nulls":11},"2nd subject",{"$nulls":11},"Codetta"]
["S1","n.0",1,2,3,4,5,6,"n.7",8,9,10,11,12,13,14,15,{"$nulls":4},"n.20",21,22,23,24,25,"n.26",27,28,29,30,31,32,33,34,35,36,37,38,"n.39",40,"n.41",42,43,44,45,46,null,48]
["S2",{"$nulls":15},"n.15","n.16",17,18,19,20]
["S3",{"$nulls":42},"n.42",43,44,45,46,47,48]
["S4"]
["S5"]
[{"$nulls":7},"b.56",{"$nulls":24},"b.81",{"$nulls":19},"b.101"]
["Development","1st subject",{"$nulls":6},"2nd subject",{"$nulls":24},"Retransition"]
["S1",49,50,51,52,53,54,55,56,57,58,59,60,61,62,63,64,65,66,67,68,69,70,71,72,73,{"$nulls":21},95,96,97,98,99,100]
["S2"]
["S3"]
["S4",{"$nulls":20},"n.69",null,71,null,73,74,75,76,77,78]
["S5",{"$nulls":32},"n.81",82,83,84,85,86,87,88,89,90,91,92,93]
[{"$nulls":8},"b.109",{"$nulls":10},"b.120",{"$nulls":11},"b.132",{"$nulls":20},"b.153"]
["Recapitulation","1st subject",{"$nulls":7},"Bridge",{"$nulls":10},"2nd subject",{"$nulls":11},"Codetta"]
["S1",101,102,103,104,105,106,107,108,109,110,111,112,113,114,115,116,"n.117",118,119,120,121,122,123,124,125,126,127,128,129,130,131,132,133,134,135,136,137,138,null,140,141,142,143,144,145]
["S2"]
["S3",{"$nulls":40},141,142,143,144,145,146,147,148,"n.149","n.150",151,152]
["S4"]
["S5"]

{"sheet":"TR Distribution","index":7,"n_rows":51,"n_cols":53,"rows_kept":51,"cut":false,"hidden":false,"merged":[[34,8,34,9],[34,19,34,20],[34,31,34,32],[34,52,34,53],[0,9,0,10],[0,21,0,22],[0,33,0,34],[0,49,0,50],[17,7,17,8],[17,32,17,33],[17,52,17,53]]}
[{"$nulls":9},"b.9",{"$nulls":11},"b.21",{"$nulls":11},"b.33",{"$nulls":15},"b.49"]
["Exposition","1st subject",{"$nulls":8},"Bridge",{"$nulls":11},"2nd subject",{"$nulls":11},"Codetta"]
["1.1.1","n.0",1,2,3,4,5,6,null,8,9,10,11,12,13,14,15,{"$nulls":32},48]
["1.6.1",{"$nulls":20},"n.20",21,22,23,24,25,{"$nulls":9},35,36]
["1.7.1"]
["2.1.1",{"$nulls":7},"n.7",8]
["3.1.1",{"$nulls":26},"n.26",27,28,29,30,31,32,33,34,null,null,37,38]
["4.1.1",{"$nulls":33},"n.33",34,35,null,37,38,39]
["5.1.1",{"$nulls":39},"n.39",40,41]
["6.1.1",{"$nulls":41},"n.41",42,43,44,45,46]
["1.4.1",{"$nulls":15},"n.15",16]
["1.5.1",{"$nulls":16},"n.16",17,18,19,20]
["1.8.1"]
["7.1.1",{"$nulls":42},"n.42",43,44,45,46,47,48]
["8.1.1"]
["1.2.1"]
["1.3.1"]
[{"$nulls":7},"b.56",{"$nulls":24},"b.81",{"$nulls":19},"b.101"]
["Development","1st subject",{"$nulls":6},"2nd subject",{"$nulls":24},"Retransition"]
["1.1.1",49,50,51,52,53,54,55,{"$nulls":39},95,96,97,98,99,100]
["1.6.1",{"$nulls":6},55,56,57,58,59,60,null,null,63,64,65,66,67,68,69,70,71,72,73]
["1.7.1"]
["2.1.1"]
["3.1.1",{"$nulls":12},61,62,63]
["4.1.1"]
["5.1.1"]
["6.1.1"]
["1.4.1"]
["1.5.1"]
["1.8.1"]
["7.1.1"]
["8.1.1"]
["1.2.1",{"$nulls":20},"n.69",null,71,null,73,74,75,76,77,78]
["1.3.1",{"$nulls":32},"n.81",82,83,84,85,86,87,88,89,90,91,92,93]
[{"$nulls":8},"b.109",{"$nulls":10},"b.120",{"$nulls":11},"b.132",{"$nulls":20},"b.153"]
["Recapitulation","1st subject",{"$nulls":7},"Bridge",{"$nulls":10},"2nd subject",{"$nulls":11},"Codetta"]
["1.1.1",101,102,103,104,105,106,null,108,109,110,111,112,113,114,115,116,117]
["1.6.1",{"$nulls":18},119,120,121,122,123,124,{"$nulls":9},134,135]
["1.7.1",{"$nulls":16},"n.117",118,119]
["2.1.1",{"$nulls":6},107,108]
["3.1.1",{"$nulls":24},125,126,127,128,129,130,131,132,133,null,null,136,137]
["4.1.1",{"$nulls":31},132,133,134,null,136,137,138]
["5.1.1"]
["6.1.1",{"$nulls":39},140,141,142,143,144,145]
["1.4.1"]
["1.5.1"]
["1.8.1",{"$nulls":48},"n.149",150]
["7.1.1",{"$nulls":40},141,142,143,144,145,146,147,148,149]
["8.1.1",{"$nulls":49},"n.150",151,152]
["1.2.1"]
["1.3.1"]

{"sheet":"Profiles and Themes","index":8,"n_rows":19,"n_cols":2,"rows_kept":19,"cut":false,"hidden":false,"merged":[]}
["Theme 1","Theme 2"]
["IMM: 000|C4-003|G4","004|C5-005|C5"]
["SIM: 011|Eb5-013|Eb5","012|Bb4-014|Db5"]
["026|G4-027|B4","031|G5-032|B5"]
["IMM: 033|C3-035|C4","037|C2-039|C3"]
["IMM: 041|D4-042|G4","043|D4-044|G4"]
["IMM: 043|D4-044|G4","045|D5-046|G5"]
["020|Fb5-027|D5","055|Gb5-062|B4"]
["055|Gb5-057|Gb5","063|Ab5-065|Ab5"]
["SIM: 069|B4-069|Gb3","071|A4-071|Fb3"]
["IMM: 081|C5-084|F6","085|C5-088|F6"]
["IMM: 088|F6-089|Db6","090|F6-091|Db6"]
["IMM: 095|Ab4-096|Eb6","097|F4-098|Db6"]
["IMM: 097|F4-098|Db6","099|Eb4-100|C6"]
["000|C4-012|Bb4","101|F4-112|Db5"]
["011|Eb5-013|Eb5","111|Bb5-113|Gb5"]
["SIM: 111|Bb5-115|G5","112|Db5-117|E5"]
["020|Fb5-039|Eb2","119|Db5-138|C3"]
["041|D4-046|G5","140|Ab4-145|E5"]

{"sheet":"Groups","index":9,"n_rows":2,"n_cols":24,"rows_kept":2,"cut":false,"hidden":false,"merged":[]}
[null,"Visual Properties",null,null,null,"Labels","Layout",null,"Do Not Edit",null,"Graph Metrics"]
["Group","Vertex Color","Vertex Shape","Visibility","Collapsed?","Label","Collapsed X","Collapsed Y","ID","Collapsed Properties","Vertices","Unique Edges","Edges With Duplicates","Total Edges","Self-Loops","Reciprocated Vertex Pair Ratio","Reciprocated Edge Ratio","Connected Components","Single-Vertex Connected Components","Maximum Vertices in a Connected Component","Maximum Edges in a Connected Component","Maximum Geodesic Distance (Diameter)","Average Geodesic Distance","Graph Density"]

{"sheet":"Group Vertices","index":10,"n_rows":1,"n_cols":3,"rows_kept":1,"cut":false,"hidden":false,"merged":[]}
["Group","Vertex","Vertex ID"]

{"sheet":"Overall Metrics","index":11,"n_rows":144,"n_cols":24,"rows_kept":144,"cut":false,"hidden":false,"merged":[]}
["Graph Metric","Value",null,"Degree Bin","Degree Frequency","In-Degree Bin","In-Degree Frequency","Out-Degree Bin","Out-Degree Frequency","Betweenness Centrality Bin","Betweenness Centrality Frequency","Closeness Centrality Bin","Closeness Centrality Frequency","Eigenvector Centrality Bin","Eigenvector Centrality Frequency","PageRank Bin","PageRank Frequency","Clustering Coefficient Bin","Clustering Coefficient Frequency","Dynamic Filter Bin","Dynamic Filter Frequency",null,"Histogram Property","Value"]
["Graph Type","Directed",null,{"$f":"MIN(Vertices[Degree])","v":0},{"$f":"COUNTIF(Vertices[Degree], \">= \" & D2) - COUNTIF(Vertices[Degree], \">=\" & D3)","v":0},{"$f":"MIN(Vertices[In-Degree])","v":0},{"$f":"COUNTIF(Vertices[In-Degree], \">= \" & F2) - COUNTIF(Vertices[In-Degree], \">=\" & F3)","v":0},{"$f":"MIN(Vertices[Out-Degree])","v":0},{"$f":"COUNTIF(Vertices[Out-Degree], \">= \" & H2) - COUNTIF(Vertices[Out-Degree], \">=\" & H3)","v":0},{"$f":"MIN(Vertices[Betweenness Centrality])","v":0},{"$f":"COUNTIF(Vertices[Betweenness Centrality], \">= \" & J2) - COUNTIF(Vertices[Betweenness Centrality], \">=\" & J3)","v":0},{"$f":"MIN(Vertices[Closeness Centrality])","v":0},{"$f":"COUNTIF(Vertices[Closeness Centrality], \">= \" & L2) - COUNTIF(Vertices[Closeness Centrality], \">=\" & L3)","v":0},{"$f":"MIN(Vertices[Eigenvector Centrality])","v":0},{"$f":"COUNTIF(Vertices[Eigenvector Centrality], \">= \" & N2) - COUNTIF(Vertices[Eigenvector Centrality], \">=\" & N3)","v":0},{"$f":"MIN(Vertices[PageRank])","v":0},{"$f":"COUNTIF(Vertices[PageRank], \">= \" & P2) - COUNTIF(Vertices[PageRank], \">=\" & P3)","v":0},{"$f":"MIN(Vertices[Clustering Coefficient])","v":0},{"$f":"COUNTIF(Vertices[Clustering Coefficient], \">= \" & R2) - COUNTIF(Vertices[Clustering Coefficient], \">=\" & R3)","v":0},{"$f":"MIN(INDIRECT(DynamicFilterSourceColumnRange))","v":3},{"$f":"COUNTIF(INDIRECT(DynamicFilterSourceColumnRange), \">= \" & T2) - COUNTIF(INDIRECT(DynamicFilterSourceColumnRange), \">=\" & T3)","v":3},null,"Bin Divisor",{"$f":"ROWS(HistogramBins[Degree Bin]) - 1","v":43}]
[null,null,null,{"$f":"D2+($D$45-$D$2)/BinDivisor","v":0},{"$f":"COUNTIF(Vertices[Degree], \">= \" & D3) - COUNTIF(Vertices[Degree], \">=\" & D4)","v":0},{"$f":"F2+($F$45-$F$2)/BinDivisor","v":0},{"$f":"COUNTIF(Vertices[In-Degree], \">= \" & F3) - COUNTIF(Vertices[In-Degree], \">=\" & F4)","v":0},{"$f":"H2+($H$45-$H$2)/BinDivisor","v":0},{"$f":"COUNTIF(Vertices[Out-Degree], \">= \" & H3) - COUNTIF(Vertices[Out-Degree], \">=\" & H4)","v":0},{"$f":"J2+($J$45-$J$2)/BinDivisor","v":0},{"$f":"COUNTIF(Vertices[Betweenness Centrality], \">= \" & J3) - COUNTIF(Vertices[Betweenness Centrality], \">=\" & J4)","v":0},{"$f":"L2+($L$45-$L$2)/BinDivisor","v":0},{"$f":"COUNTIF(Vertices[Closeness Centrality], \">= \" & L3) - COUNTIF(Vertices[Closeness Centrality], \">=\" & L4)","v":0},{"$f":"N2+($N$45-$N$2)/BinDivisor","v":0},{"$f":"COUNTIF(Vertices[Eigenvector Centrality], \">= \" & N3) - COUNTIF(Vertices[Eigenvector Centrality], \">=\" & N4)","v":0},{"$f":"P2+($P$45-$P$2)/BinDivisor","v":0},{"$f":"COUNTIF(Vertices[PageRank], \">= \" & P3) - COUNTIF(Vertices[PageRank], \">=\" & P4)","v":0},{"$f":"R2+($R$45-$R$2)/BinDivisor","v":0},{"$f":"COUNTIF(Vertices[Clustering Coefficient], \">= \" & R3) - COUNTIF(Vertices[Clustering Coefficient], \">=\" & R4)","v":0},{"$f":"T2+($T$45-$T$2)/BinDivisor","v":6.470930232558139},2,null,"No Metric Message","Not Available"]
["Vertices",127,null,0,{"$f":"COUNTIF(Vertices[Degree], \">= \" & D4) - COUNTIF(Vertices[Degree], \">=\" & D5)","v":0},0,{"$f":"COUNTIF(Vertices[In-Degree], \">= \" & F4) - COUNTIF(Vertices[In-Degree], \">=\" & F5)","v":0},0,{"$f":"COUNTIF(Vertices[Out-Degree], \">= \" & H4) - COUNTIF(Vertices[Out-Degree], \">=\" & H5)","v":0},0,{"$f":"COUNTIF(Vertices[Betweenness Centrality], \">= \" & J4) - COUNTIF(Vertices[Betweenness Centrality], \">=\" & J5)","v":0},0,{"$f":"COUNTIF(Vertices[Closeness Centrality], \">= \" & L4) - COUNTIF(Vertices[Closeness Centrality], \">=\" & L5)","v":0},0,{"$f":"COUNTIF(Vertices[Eigenvector Centrality], \">= \" & N4) - COUNTIF(Vertices[Eigenvector Centrality], \">=\" & N5)","v":0},0,{"$f":"COUNTIF(Vertices[PageRank], \">= \" & P4) - COUNTIF(Vertices[PageRank], \">=\" & P5)","v":0},0,{"$f":"COUNTIF(Vertices[Clustering Coefficient], \">= \" & R4) - COUNTIF(Vertices[Clustering Coefficient], \">=\" & R5)","v":0},9.9418604651162781,2,null,"Dynamic Filter Source Column Range","Vertices[Offset]"]
[null,null,null,0,{"$f":"COUNTIF(Vertices[Degree], \">= \" & D5) - COUNTIF(Vertices[Degree], \">=\" & D6)","v":0},0,{"$f":"COUNTIF(Vertices[In-Degree], \">= \" & F5) - COUNTIF(Vertices[In-Degree], \">=\" & F6)","v":0},0,{"$f":"COUNTIF(Vertices[Out-Degree], \">= \" & H5) - COUNTIF(Vertices[Out-Degree], \">=\" & H6)","v":0},0,{"$f":"COUNTIF(Vertices[Betweenness Centrality], \">= \" & J5) - COUNTIF(Vertices[Betweenness Centrality], \">=\" & J6)","v":0},0,{"$f":"COUNTIF(Vertices[Closeness Centrality], \">= \" & L5) - COUNTIF(Vertices[Closeness Centrality], \">=\" & L6)","v":0},0,{"$f":"COUNTIF(Vertices[Eigenvector Centrality], \">= \" & N5) - COUNTIF(Vertices[Eigenvector Centrality], \">=\" & N6)","v":0},0,{"$f":"COUNTIF(Vertices[PageRank], \">= \" & P5) - COUNTIF(Vertices[PageRank], \">=\" & P6)","v":0},0,{"$f":"COUNTIF(Vertices[Clustering Coefficient], \">= \" & R5) - COUNTIF(Vertices[Clustering Coefficient], \">=\" & R6)","v":0},13.412790697674417,4]
["Unique Edges",599,null,0,{"$f":"COUNTIF(Vertices[Degree], \">= \" & D6) - COUNTIF(Vertices[Degree], \">=\" & D7)","v":0},0,{"$f":"COUNTIF(Vertices[In-Degree], \">= \" & F6) - COUNTIF(Vertices[In-Degree], \">=\" & F7)","v":0},0,{"$f":"COUNTIF(Vertices[Out-Degree], \">= \" & H6) - COUNTIF(Vertices[Out-Degree], \">=\" & H7)","v":0},0,{"$f":"COUNTIF(Vertices[Betweenness Centrality], \">= \" & J6) - COUNTIF(Vertices[Betweenness Centrality], \">=\" & J7)","v":0},0,{"$f":"COUNTIF(Vertices[Closeness Centrality], \">= \" & L6) - COUNTIF(Vertices[Closeness Centrality], \">=\" & L7)","v":0},0,{"$f":"COUNTIF(Vertices[Eigenvector Centrality], \">= \" & N6) - COUNTIF(Vertices[Eigenvector Centrality], \">=\" & N7)","v":0},0,{"$f":"COUNTIF(Vertices[PageRank], \">= \" & P6) - COUNTIF(Vertices[PageRank], \">=\" & P7)","v":0},0,{"$f":"COUNTIF(Vertices[Clustering Coefficient], \">= \" & R6) - COUNTIF(Vertices[Clustering Coefficient], \">=\" & R7)","v":0},16.883720930232556,2]
["Edges With Duplicates",0,null,0,{"$f":"COUNTIF(Vertices[Degree], \">= \" & D7) - COUNTIF(Vertices[Degree], \">=\" & D8)","v":0},0,{"$f":"COUNTIF(Vertices[In-Degree], \">= \" & F7) - COUNTIF(Vertices[In-Degree], \">=\" & F8)","v":0},0,{"$f":"COUNTIF(Vertices[Out-Degree], \">= \" & H7) - COUNTIF(Vertices[Out-Degree], \">=\" & H8)","v":0},0,{"$f":"COUNTIF(Vertices[Betweenness Centrality], \">= \" & J7) - COUNTIF(Vertices[Betweenness Centrality], \">=\" & J8)","v":0},0,{"$f":"COUNTIF(Vertices[Closeness Centrality], \">= \" & L7) - COUNTIF(Vertices[Closeness Centrality], \">=\" & L8)","v":0},0,{"$f":"COUNTIF(Vertices[Eigenvector Centrality], \">= \" & N7) - COUNTIF(Vertices[Eigenvector Centrality], \">=\" & N8)","v":0},0,{"$f":"COUNTIF(Vertices[PageRank], \">= \" & P7) - COUNTIF(Vertices[PageRank], \">=\" & P8)","v":0},0,{"$f":"COUNTIF(Vertices[Clustering Coefficient], \">= \" & R7) - COUNTIF(Vertices[Clustering Coefficient], \">=\" & R8)","v":0},20.354651162790695,1]
["Total Edges",599,null,0,{"$f":"COUNTIF(Vertices[Degree], \">= \" & D8) - COUNTIF(Vertices[Degree], \">=\" & D9)","v":0},0,{"$f":"COUNTIF(Vertices[In-Degree], \">= \" & F8) - COUNTIF(Vertices[In-Degree], \">=\" & F9)","v":0},0,{"$f":"COUNTIF(Vertices[Out-Degree], \">= \" & H8) - COUNTIF(Vertices[Out-Degree], \">=\" & H9)","v":0},0,{"$f":"COUNTIF(Vertices[Betweenness Centrality], \">= \" & J8) - COUNTIF(Vertices[Betweenness Centrality], \">=\" & J9)","v":0},0,{"$f":"COUNTIF(Vertices[Closeness Centrality], \">= \" & L8) - COUNTIF(Vertices[Closeness Centrality], \">=\" & L9)","v":0},0,{"$f":"COUNTIF(Vertices[Eigenvector Centrality], \">= \" & N8) - COUNTIF(Vertices[Eigenvector Centrality], \">=\" & N9)","v":0},0,{"$f":"COUNTIF(Vertices[PageRank], \">= \" & P8) - COUNTIF(Vertices[PageRank], \">=\" & P9)","v":0},0,{"$f":"COUNTIF(Vertices[Clustering Coefficient], \">= \" & R8) - COUNTIF(Vertices[Clustering Coefficient], \">=\" & R9)","v":0},23.825581395348834,4]
[null,null,null,0,{"$f":"COUNTIF(Vertices[Degree], \">= \" & D9) - COUNTIF(Vertices[Degree], \">=\" & D10)","v":0},0,{"$f":"COUNTIF(Vertices[In-Degree], \">= \" & F9) - COUNTIF(Vertices[In-Degree], \">=\" & F10)","v":0},0,{"$f":"COUNTIF(Vertices[Out-Degree], \">= \" & H9) - COUNTIF(Vertices[Out-Degree], \">=\" & H10)","v":0},0,{"$f":"COUNTIF(Vertices[Betweenness Centrality], \">= \" & J9) - COUNTIF(Vertices[Betweenness Centrality], \">=\" & J10)","v":0},0,{"$f":"COUNTIF(Vertices[Closeness Centrality], \">= \" & L9) - COUNTIF(Vertices[Closeness Centrality], \">=\" & L10)","v":0},0,{"$f":"COUNTIF(Vertices[Eigenvector Centrality], \">= \" & N9) - COUNTIF(Vertices[Eigenvector Centrality], \">=\" & N10)","v":0},0,{"$f":"COUNTIF(Vertices[PageRank], \">= \" & P9) - COUNTIF(Vertices[PageRank], \">=\" & P10)","v":0},0,{"$f":"COUNTIF(Vertices[Clustering Coefficient], \">= \" & R9) - COUNTIF(Vertices[Clustering Coefficient], \">=\" & R10)","v":0},27.296511627906973,4]
["Self-Loops",0,null,0,{"$f":"COUNTIF(Vertices[Degree], \">= \" & D10) - COUNTIF(Vertices[Degree], \">=\" & D11)","v":0},0,{"$f":"COUNTIF(Vertices[In-Degree], \">= \" & F10) - COUNTIF(Vertices[In-Degree], \">=\" & F11)","v":0},0,{"$f":"COUNTIF(Vertices[Out-Degree], \">= \" & H10) - COUNTIF(Vertices[Out-Degree], \">=\" & H11)","v":0},0,{"$f":"COUNTIF(Vertices[Betweenness Centrality], \">= \" & J10) - COUNTIF(Vertices[Betweenness Centrality], \">=\" & J11)","v":0},0,{"$f":"COUNTIF(Vertices[Closeness Centrality], \">= \" & L10) - COUNTIF(Vertices[Closeness Centrality], \">=\" & L11)","v":0},0,{"$f":"COUNTIF(Vertices[Eigenvector Centrality], \">= \" & N10) - COUNTIF(Vertices[Eigenvector Centrality], \">=\" & N11)","v":0},0,{"$f":"COUNTIF(Vertices[PageRank], \">= \" & P10) - COUNTIF(Vertices[PageRank], \">=\" & P11)","v":0},0,{"$f":"COUNTIF(Vertices[Clustering Coefficient], \">= \" & R10) - COUNTIF(Vertices[Clustering Coefficient], \">=\" & R11)","v":0},30.767441860465112,7]
[null,null,null,0,{"$f":"COUNTIF(Vertices[Degree], \">= \" & D11) - COUNTIF(Vertices[Degree], \">=\" & D12)","v":0},0,{"$f":"COUNTIF(Vertices[In-Degree], \">= \" & F11) - COUNTIF(Vertices[In-Degree], \">=\" & F12)","v":0},0,{"$f":"COUNTIF(Vertices[Out-Degree], \">= \" & H11) - COUNTIF(Vertices[Out-Degree], \">=\" & H12)","v":0},0,{"$f":"COUNTIF(Vertices[Betweenness Centrality], \">= \" & J11) - COUNTIF(Vertices[Betweenness Centrality], \">=\" & J12)","v":0},0,{"$f":"COUNTIF(Vertices[Closeness Centrality], \">= \" & L11) - COUNTIF(Vertices[Closeness Centrality], \">=\" & L12)","v":0},0,{"$f":"COUNTIF(Vertices[Eigenvector Centrality], \">= \" & N11) - COUNTIF(Vertices[Eigenvector Centrality], \">=\" & N12)","v":0},0,{"$f":"COUNTIF(Vertices[PageRank], \">= \" & P11) - COUNTIF(Vertices[PageRank], \">=\" & P12)","v":0},0,{"$f":"COUNTIF(Vertices[Clustering Coefficient], \">= \" & R11) - COUNTIF(Vertices[Clustering Coefficient], \">=\" & R12)","v":0},34.238372093023251,3]
["Reciprocated Vertex Pair Ratio",0,null,0,{"$f":"COUNTIF(Vertices[Degree], \">= \" & D12) - COUNTIF(Vertices[Degree], \">=\" & D13)","v":0},0,{"$f":"COUNTIF(Vertices[In-Degree], \">= \" & F12) - COUNTIF(Vertices[In-Degree], \">=\" & F13)","v":0},0,{"$f":"COUNTIF(Vertices[Out-Degree], \">= \" & H12) - COUNTIF(Vertices[Out-Degree], \">=\" & H13)","v":0},0,{"$f":"COUNTIF(Vertices[Betweenness Centrality], \">= \" & J12) - COUNTIF(Vertices[Betweenness Centrality], \">=\" & J13)","v":0},0,{"$f":"COUNTIF(Vertices[Closeness Centrality], \">= \" & L12) - COUNTIF(Vertices[Closeness Centrality], \">=\" & L13)","v":0},0,{"$f":"COUNTIF(Vertices[Eigenvector Centrality], \">= \" & N12) - COUNTIF(Vertices[Eigenvector Centrality], \">=\" & N13)","v":0},0,{"$f":"COUNTIF(Vertices[PageRank], \">= \" & P12) - COUNTIF(Vertices[PageRank], \">=\" & P13)","v":0},0,{"$f":"COUNTIF(Vertices[Clustering Coefficient], \">= \" & R12) - COUNTIF(Vertices[Clustering Coefficient], \">=\" & R13)","v":0},37.70930232558139,4]
["Reciprocated Edge Ratio",0,null,0,{"$f":"COUNTIF(Vertices[Degree], \">= \" & D13) - COUNTIF(Vertices[Degree], \">=\" & D14)","v":0},0,{"$f":"COUNTIF(Vertices[In-Degree], \">= \" & F13) - COUNTIF(Vertices[In-Degree], \">=\" & F14)","v":0},0,{"$f":"COUNTIF(Vertices[Out-Degree], \">= \" & H13) - COUNTIF(Vertices[Out-Degree], \">=\" & H14)","v":0},0,{"$f":"COUNTIF(Vertices[Betweenness Centrality], \">= \" & J13) - COUNTIF(Vertices[Betweenness Centrality], \">=\" & J14)","v":0},0,{"$f":"COUNTIF(Vertices[Closeness Centrality], \">= \" & L13) - COUNTIF(Vertices[Closeness Centrality], \">=\" & L14)","v":0},0,{"$f":"COUNTIF(Vertices[Eigenvector Centrality], \">= \" & N13) - COUNTIF(Vertices[Eigenvector Centrality], \">=\" & N14)","v":0},0,{"$f":"COUNTIF(Vertices[PageRank], \">= \" & P13) - COUNTIF(Vertices[PageRank], \">=\" & P14)","v":0},0,{"$f":"COUNTIF(Vertices[Clustering Coefficient], \">= \" & R13) - COUNTIF(Vertices[Clustering Coefficient], \">=\" & R14)","v":0},41.180232558139529,4]
[null,null,null,0,{"$f":"COUNTIF(Vertices[Degree], \">= \" & D14) - COUNTIF(Vertices[Degree], \">=\" & D15)","v":0},0,{"$f":"COUNTIF(Vertices[In-Degree], \">= \" & F14) - COUNTIF(Vertices[In-Degree], \">=\" & F15)","v":0},0,{"$f":"COUNTIF(Vertices[Out-Degree], \">= \" & H14) - COUNTIF(Vertices[Out-Degree], \">=\" & H15)","v":0},0,{"$f":"COUNTIF(Vertices[Betweenness Centrality], \">= \" & J14) - COUNTIF(Vertices[Betweenness Centrality], \">=\" & J15)","v":0},0,{"$f":"COUNTIF(Vertices[Closeness Centrality], \">= \" & L14) - COUNTIF(Vertices[Closeness Centrality], \">=\" & L15)","v":0},0,{"$f":"COUNTIF(Vertices[Eigenvector Centrality], \">= \" & N14) - COUNTIF(Vertices[Eigenvector Centrality], \">=\" & N15)","v":0},0,{"$f":"COUNTIF(Vertices[PageRank], \">= \" & P14) - COUNTIF(Vertices[PageRank], \">=\" & P15)","v":0},0,{"$f":"COUNTIF(Vertices[Clustering Coefficient], \">= \" & R14) - COUNTIF(Vertices[Clustering Coefficient], \">=\" & R15)","v":0},44.651162790697668,2]
["Connected Components",8,null,0,{"$f":"COUNTIF(Vertices[Degree], \">= \" & D15) - COUNTIF(Vertices[Degree], \">=\" & D16)","v":0},0,{"$f":"COUNTIF(Vertices[In-Degree], \">= \" & F15) - COUNTIF(Vertices[In-Degree], \">=\" & F16)","v":0},0,{"$f":"COUNTIF(Vertices[Out-Degree], \">= \" & H15) - COUNTIF(Vertices[Out-Degree], \">=\" & H16)","v":0},0,{"$f":"COUNTIF(Vertices[Betweenness Centrality], \">= \" & J15) - COUNTIF(Vertices[Betweenness Centrality], \">=\" & J16)","v":0},0,{"$f":"COUNTIF(Vertices[Closeness Centrality], \">= \" & L15) - COUNTIF(Vertices[Closeness Centrality], \">=\" & L16)","v":0},0,{"$f":"COUNTIF(Vertices[Eigenvector Centrality], \">= \" & N15) - COUNTIF(Vertices[Eigenvector Centrality], \">=\" & N16)","v":0},0,{"$f":"COUNTIF(Vertices[PageRank], \">= \" & P15) - COUNTIF(Vertices[PageRank], \">=\" & P16)","v":0},0,{"$f":"COUNTIF(Vertices[Clustering Coefficient], \">= \" & R15) - COUNTIF(Vertices[Clustering Coefficient], \">=\" & R16)","v":0},48.122093023255808,2]
["Single-Vertex Connected Components",2,null,0,{"$f":"COUNTIF(Vertices[Degree], \">= \" & D16) - COUNTIF(Vertices[Degree], \">=\" & D17)","v":0},0,{"$f":"COUNTIF(Vertices[In-Degree], \">= \" & F16) - COUNTIF(Vertices[In-Degree], \">=\" & F17)","v":0},0,{"$f":"COUNTIF(Vertices[Out-Degree], \">= \" & H16) - COUNTIF(Vertices[Out-Degree], \">=\" & H17)","v":0},0,{"$f":"COUNTIF(Vertices[Betweenness Centrality], \">= \" & J16) - COUNTIF(Vertices[Betweenness Centrality], \">=\" & J17)","v":0},0,{"$f":"COUNTIF(Vertices[Closeness Centrality], \">= \" & L16) - COUNTIF(Vertices[Closeness Centrality], \">=\" & L17)","v":0},0,{"$f":"COUNTIF(Vertices[Eigenvector Centrality], \">= \" & N16) - COUNTIF(Vertices[Eigenvector Centrality], \">=\" & N17)","v":0},0,{"$f":"COUNTIF(Vertices[PageRank], \">= \" & P16) - COUNTIF(Vertices[PageRank], \">=\" & P17)","v":0},0,{"$f":"COUNTIF(Vertices[Clustering Coefficient], \">= \" & R16) - COUNTIF(Vertices[Clustering Coefficient], \">=\" & R17)","v":0},51.593023255813947,2]
["Maximum Vertices in a Connected Component",68,null,0,{"$f":"COUNTIF(Vertices[Degree], \">= \" & D17) - COUNTIF(Vertices[Degree], \">=\" & D18)","v":0},0,{"$f":"COUNTIF(Vertices[In-Degree], \">= \" & F17) - COUNTIF(Vertices[In-Degree], \">=\" & F18)","v":0},0,{"$f":"COUNTIF(Vertices[Out-Degree], \">= \" & H17) - COUNTIF(Vertices[Out-Degree], \">=\" & H18)","v":0},0,{"$f":"COUNTIF(Vertices[Betweenness Centrality], \">= \" & J17) - COUNTIF(Vertices[Betweenness Centrality], \">=\" & J18)","v":0},0,{"$f":"COUNTIF(Vertices[Closeness Centrality], \">= \" & L17) - COUNTIF(Vertices[Closeness Centrality], \">=\" & L18)","v":0},0,{"$f":"COUNTIF(Vertices[Eigenvector Centrality], \">= \" & N17) - COUNTIF(Vertices[Eigenvector Centrality], \">=\" & N18)","v":0},0,{"$f":"COUNTIF(Vertices[PageRank], \">= \" & P17) - COUNTIF(Vertices[PageRank], \">=\" & P18)","v":0},0,{"$f":"COUNTIF(Vertices[Clustering Coefficient], \">= \" & R17) - COUNTIF(Vertices[Clustering Coefficient], \">=\" & R18)","v":0},55.063953488372086,2]
["Maximum Edges in a Connected Component",310,null,0,{"$f":"COUNTIF(Vertices[Degree], \">= \" & D18) - COUNTIF(Vertices[Degree], \">=\" & D19)","v":0},0,{"$f":"COUNTIF(Vertices[In-Degree], \">= \" & F18) - COUNTIF(Vertices[In-Degree], \">=\" & F19)","v":0},0,{"$f":"COUNTIF(Vertices[Out-Degree], \">= \" & H18) - COUNTIF(Vertices[Out-Degree], \">=\" & H19)","v":0},0,{"$f":"COUNTIF(Vertices[Betweenness Centrality], \">= \" & J18) - COUNTIF(Vertices[Betweenness Centrality], \">=\" & J19)","v":0},0,{"$f":"COUNTIF(Vertices[Closeness Centrality], \">= \" & L18) - COUNTIF(Vertices[Closeness Centrality], \">=\" & L19)","v":0},0,{"$f":"COUNTIF(Vertices[Eigenvector Centrality], \">= \" & N18) - COUNTIF(Vertices[Eigenvector Centrality], \">=\" & N19)","v":0},0,{"$f":"COUNTIF(Vertices[PageRank], \">= \" & P18) - COUNTIF(Vertices[PageRank], \">=\" & P19)","v":0},0,{"$f":"COUNTIF(Vertices[Clustering Coefficient], \">= \" & R18) - COUNTIF(Vertices[Clustering Coefficient], \">=\" & R19)","v":0},58.534883720930225,4]
[null,null,null,0,{"$f":"COUNTIF(Vertices[Degree], \">= \" & D19) - COUNTIF(Vertices[Degree], \">=\" & D20)","v":0},0,{"$f":"COUNTIF(Vertices[In-Degree], \">= \" & F19) - COUNTIF(Vertices[In-Degree], \">=\" & F20)","v":0},0,{"$f":"COUNTIF(Vertices[Out-Degree], \">= \" & H19) - COUNTIF(Vertices[Out-Degree], \">=\" & H20)","v":0},0,{"$f":"COUNTIF(Vertices[Betweenness Centrality], \">= \" & J19) - COUNTIF(Vertices[Betweenness Centrality], \">=\" & J20)","v":0},0,{"$f":"COUNTIF(Vertices[Closeness Centrality], \">= \" & L19) - COUNTIF(Vertices[Closeness Centrality], \">=\" & L20)","v":0},0,{"$f":"COUNTIF(Vertices[Eigenvector Centrality], \">= \" & N19) - COUNTIF(Vertices[Eigenvector Centrality], \">=\" & N20)","v":0},0,{"$f":"COUNTIF(Vertices[PageRank], \">= \" & P19) - COUNTIF(Vertices[PageRank], \">=\" & P20)","v":0},0,{"$f":"COUNTIF(Vertices[Clustering Coefficient], \">= \" & R19) - COUNTIF(Vertices[Clustering Coefficient], \">=\" & R20)","v":0},62.005813953488364,2]
["Maximum Geodesic Distance (Diameter)",6,null,0,{"$f":"COUNTIF(Vertices[Degree], \">= \" & D20) - COUNTIF(Vertices[Degree], \">=\" & D21)","v":0},0,{"$f":"COUNTIF(Vertices[In-Degree], \">= \" & F20) - COUNTIF(Vertices[In-Degree], \">=\" & F21)","v":0},0,{"$f":"COUNTIF(Vertices[Out-Degree], \">= \" & H20) - COUNTIF(Vertices[Out-Degree], \">=\" & H21)","v":0},0,{"$f":"COUNTIF(Vertices[Betweenness Centrality], \">= \" & J20) - COUNTIF(Vertices[Betweenness Centrality], \">=\" & J21)","v":0},0,{"$f":"COUNTIF(Vertices[Closeness Centrality], \">= \" & L20) - COUNTIF(Vertices[Closeness Centrality], \">=\" & L21)","v":0},0,{"$f":"COUNTIF(Vertices[Eigenvector Centrality], \">= \" & N20) - COUNTIF(Vertices[Eigenvector Centrality], \">=\" & N21)","v":0},0,{"$f":"COUNTIF(Vertices[PageRank], \">= \" & P20) - COUNTIF(Vertices[PageRank], \">=\" & P21)","v":0},0,{"$f":"COUNTIF(Vertices[Clustering Coefficient], \">= \" & R20) - COUNTIF(Vertices[Clustering Coefficient], \">=\" & R21)","v":0},65.476744186046503,2]
["Average Geodesic Distance",2.77054,null,0,{"$f":"COUNTIF(Vertices[Degree], \">= \" & D21) - COUNTIF(Vertices[Degree], \">=\" & D22)","v":0},0,{"$f":"COUNTIF(Vertices[In-Degree], \">= \" & F21) - COUNTIF(Vertices[In-Degree], \">=\" & F22)","v":0},0,{"$f":"COUNTIF(Vertices[Out-Degree], \">= \" & H21) - COUNTIF(Vertices[Out-Degree], \">=\" & H22)","v":0},0,{"$f":"COUNTIF(Vertices[Betweenness Centrality], \">= \" & J21) - COUNTIF(Vertices[Betweenness Centrality], \">=\" & J22)","v":0},0,{"$f":"COUNTIF(Vertices[Closeness Centrality], \">= \" & L21) - COUNTIF(Vertices[Closeness Centrality], \">=\" & L22)","v":0},0,{"$f":"COUNTIF(Vertices[Eigenvector Centrality], \">= \" & N21) - COUNTIF(Vertices[Eigenvector Centrality], \">=\" & N22)","v":0},0,{"$f":"COUNTIF(Vertices[PageRank], \">= \" & P21) - COUNTIF(Vertices[PageRank], \">=\" & P22)","v":0},0,{"$f":"COUNTIF(Vertices[Clustering Coefficient], \">= \" & R21) - COUNTIF(Vertices[Clustering Coefficient], \">=\" & R22)","v":0},68.947674418604649,4]
[null,null,null,0,{"$f":"COUNTIF(Vertices[Degree], \">= \" & D22) - COUNTIF(Vertices[Degree], \">=\" & D23)","v":0},0,{"$f":"COUNTIF(Vertices[In-Degree], \">= \" & F22) - COUNTIF(Vertices[In-Degree], \">=\" & F23)","v":0},0,{"$f":"COUNTIF(Vertices[Out-Degree], \">= \" & H22) - COUNTIF(Vertices[Out-Degree], \">=\" & H23)","v":0},0,{"$f":"COUNTIF(Vertices[Betweenness Centrality], \">= \" & J22) - COUNTIF(Vertices[Betweenness Centrality], \">=\" & J23)","v":0},0,{"$f":"COUNTIF(Vertices[Closeness Centrality], \">= \" & L22) - COUNTIF(Vertices[Closeness Centrality], \">=\" & L23)","v":0},0,{"$f":"COUNTIF(Vertices[Eigenvector Centrality], \">= \" & N22) - COUNTIF(Vertices[Eigenvector Centrality], \">=\" & N23)","v":0},0,{"$f":"COUNTIF(Vertices[PageRank], \">= \" & P22) - COUNTIF(Vertices[PageRank], \">=\" & P23)","v":0},0,{"$f":"COUNTIF(Vertices[Clustering Coefficient], \">= \" & R22) - COUNTIF(Vertices[Clustering Coefficient], \">=\" & R23)","v":0},72.418604651162795,2]
["Graph Density",3.7432820897387829E-2,null,0,{"$f":"COUNTIF(Vertices[Degree], \">= \" & D23) - COUNTIF(Vertices[Degree], \">=\" & D24)","v":0},0,{"$f":"COUNTIF(Vertices[In-Degree], \">= \" & F23) - COUNTIF(Vertices[In-Degree], \">=\" & F24)","v":0},0,{"$f":"COUNTIF(Vertices[Out-Degree], \">= \" & H23) - COUNTIF(Vertices[Out-Degree], \">=\" & H24)","v":0},0,{"$f":"COUNTIF(Vertices[Betweenness Centrality], \">= \" & J23) - COUNTIF(Vertices[Betweenness Centrality], \">=\" & J24)","v":0},0,{"$f":"COUNTIF(Vertices[Closeness Centrality], \">= \" & L23) - COUNTIF(Vertices[Closeness Centrality], \">=\" & L24)","v":0},0,{"$f":"COUNTIF(Vertices[Eigenvector Centrality], \">= \" & N23) - COUNTIF(Vertices[Eigenvector Centrality], \">=\" & N24)","v":0},0,{"$f":"COUNTIF(Vertices[PageRank], \">= \" & P23) - COUNTIF(Vertices[PageRank], \">=\" & P24)","v":0},0,{"$f":"COUNTIF(Vertices[Clustering Coefficient], \">= \" & R23) - COUNTIF(Vertices[Clustering Coefficient], \">=\" & R24)","v":0},75.889534883720941,2]
["Modularity",0.61797500000000005,null,0,{"$f":"COUNTIF(Vertices[Degree], \">= \" & D24) - COUNTIF(Vertices[Degree], \">=\" & D25)","v":0},0,{"$f":"COUNTIF(Vertices[In-Degree], \">= \" & F24) - COUNTIF(Vertices[In-Degree], \">=\" & F25)","v":0},0,{"$f":"COUNTIF(Vertices[Out-Degree], \">= \" & H24) - COUNTIF(Vertices[Out-Degree], \">=\" & H25)","v":0},0,{"$f":"COUNTIF(Vertices[Betweenness Centrality], \">= \" & J24) - COUNTIF(Vertices[Betweenness Centrality], \">=\" & J25)","v":0},0,{"$f":"COUNTIF(Vertices[Closeness Centrality], \">= \" & L24) - COUNTIF(Vertices[Closeness Centrality], \">=\" & L25)","v":0},0,{"$f":"COUNTIF(Vertices[Eigenvector Centrality], \">= \" & N24) - COUNTIF(Vertices[Eigenvector Centrality], \">=\" & N25)","v":0},0,{"$f":"COUNTIF(Vertices[PageRank], \">= \" & P24) - COUNTIF(Vertices[PageRank], \">=\" & P25)","v":0},0,{"$f":"COUNTIF(Vertices[Clustering Coefficient], \">= \" & R24) - COUNTIF(Vertices[Clustering Coefficient], \">=\" & R25)","v":0},79.360465116279087,1]
[null,null,null,0,{"$f":"COUNTIF(Vertices[Degree], \">= \" & D25) - COUNTIF(Vertices[Degree], \">=\" & D26)","v":0},0,{"$f":"COUNTIF(Vertices[In-Degree], \">= \" & F25) - COUNTIF(Vertices[In-Degree], \">=\" & F26)","v":0},0,{"$f":"COUNTIF(Vertices[Out-Degree], \">= \" & H25) - COUNTIF(Vertices[Out-Degree], \">=\" & H26)","v":0},0,{"$f":"COUNTIF(Vertices[Betweenness Centrality], \">= \" & J25) - COUNTIF(Vertices[Betweenness Centrality], \">=\" & J26)","v":0},0,{"$f":"COUNTIF(Vertices[Closeness Centrality], \">= \" & L25) - COUNTIF(Vertices[Closeness Centrality], \">=\" & L26)","v":0},0,{"$f":"COUNTIF(Vertices[Eigenvector Centrality], \">= \" & N25) - COUNTIF(Vertices[Eigenvector Centrality], \">=\" & N26)","v":0},0,{"$f":"COUNTIF(Vertices[PageRank], \">= \" & P25) - COUNTIF(Vertices[PageRank], \">=\" & P26)","v":0},0,{"$f":"COUNTIF(Vertices[Clustering Coefficient], \">= \" & R25) - COUNTIF(Vertices[Clustering Coefficient], \">=\" & R26)","v":0},82.831395348837233,3]
["NodeXL Version","1.0.1.245",null,0,{"$f":"COUNTIF(Vertices[Degree], \">= \" & D26) - COUNTIF(Vertices[Degree], \">=\" & D27)","v":0},0,{"$f":"COUNTIF(Vertices[In-Degree], \">= \" & F26) - COUNTIF(Vertices[In-Degree], \">=\" & F27)","v":0},0,{"$f":"COUNTIF(Vertices[Out-Degree], \">= \" & H26) - COUNTIF(Vertices[Out-Degree], \">=\" & H27)","v":0},0,{"$f":"COUNTIF(Vertices[Betweenness Centrality], \">= \" & J26) - COUNTIF(Vertices[Betweenness Centrality], \">=\" & J27)","v":0},0,{"$f":"COUNTIF(Vertices[Closeness Centrality], \">= \" & L26) - COUNTIF(Vertices[Closeness Centrality], \">=\" & L27)","v":0},0,{"$f":"COUNTIF(Vertices[Eigenvector Centrality], \">= \" & N26) - COUNTIF(Vertices[Eigenvector Centrality], \">=\" & N27)","v":0},0,{"$f":"COUNTIF(Vertices[PageRank], \">= \" & P26) - COUNTIF(Vertices[PageRank], \">=\" & P27)","v":0},0,{"$f":"COUNTIF(Vertices[Clustering Coefficient], \">= \" & R26) - COUNTIF(Vertices[Clustering Coefficient], \">=\" & R27)","v":0},86.30232558139538,4]
[null,null,null,0,{"$f":"COUNTIF(Vertices[Degree], \">= \" & D27) - COUNTIF(Vertices[Degree], \">=\" & D28)","v":0},0,{"$f":"COUNTIF(Vertices[In-Degree], \">= \" & F27) - COUNTIF(Vertices[In-Degree], \">=\" & F28)","v":0},0,{"$f":"COUNTIF(Vertices[Out-Degree], \">= \" & H27) - COUNTIF(Vertices[Out-Degree], \">=\" & H28)","v":0},0,{"$f":"COUNTIF(Vertices[Betweenness Centrality], \">= \" & J27) - COUNTIF(Vertices[Betweenness Centrality], \">=\" & J28)","v":0},0,{"$f":"COUNTIF(Vertices[Closeness Centrality], \">= \" & L27) - COUNTIF(Vertices[Closeness Centrality], \">=\" & L28)","v":0},0,{"$f":"COUNTIF(Vertices[Eigenvector Centrality], \">= \" & N27) - COUNTIF(Vertices[Eigenvector Centrality], \">=\" & N28)","v":0},0,{"$f":"COUNTIF(Vertices[PageRank], \">= \" & P27) - COUNTIF(Vertices[PageRank], \">=\" & P28)","v":0},0,{"$f":"COUNTIF(Vertices[Clustering Coefficient], \">= \" & R27) - COUNTIF(Vertices[Clustering Coefficient], \">=\" & R28)","v":0},89.773255813953526,3]
[null,null,null,0,{"$f":"COUNTIF(Vertices[Degree], \">= \" & D28) - COUNTIF(Vertices[Degree], \">=\" & D29)","v":0},0,{"$f":"COUNTIF(Vertices[In-Degree], \">= \" & F28) - COUNTIF(Vertices[In-Degree], \">=\" & F29)","v":0},0,{"$f":"COUNTIF(Vertices[Out-Degree], \">= \" & H28) - COUNTIF(Vertices[Out-Degree], \">=\" & H29)","v":0},0,{"$f":"COUNTIF(Vertices[Betweenness Centrality], \">= \" & J28) - COUNTIF(Vertices[Betweenness Centrality], \">=\" & J29)","v":0},0,{"$f":"COUNTIF(Vertices[Closeness Centrality], \">= \" & L28) - COUNTIF(Vertices[Closeness Centrality], \">=\" & L29)","v":0},0,{"$f":"COUNTIF(Vertices[Eigenvector Centrality], \">= \" & N28) - COUNTIF(Vertices[Eigenvector Centrality], \">=\" & N29)","v":0},0,{"$f":"COUNTIF(Vertices[PageRank], \">= \" & P28) - COUNTIF(Vertices[PageRank], \">=\" & P29)","v":0},0,{"$f":"COUNTIF(Vertices[Clustering Coefficient], \">= \" & R28) - COUNTIF(Vertices[Clustering Coefficient], \">=\" & R29)","v":0},93.244186046511672,2]
["Readability Metric","Value",null,0,{"$f":"COUNTIF(Vertices[Degree], \">= \" & D29) - COUNTIF(Vertices[Degree], \">=\" & D30)","v":0},0,{"$f":"COUNTIF(Vertices[In-Degree], \">= \" & F29) - COUNTIF(Vertices[In-Degree], \">=\" & F30)","v":0},0,{"$f":"COUNTIF(Vertices[Out-Degree], \">= \" & H29) - COUNTIF(Vertices[Out-Degree], \">=\" & H30)","v":0},0,{"$f":"COUNTIF(Vertices[Betweenness Centrality], \">= \" & J29) - COUNTIF(Vertices[Betweenness Centrality], \">=\" & J30)","v":0},0,{"$f":"COUNTIF(Vertices[Closeness Centrality], \">= \" & L29) - COUNTIF(Vertices[Closeness Centrality], \">=\" & L30)","v":0},0,{"$f":"COUNTIF(Vertices[Eigenvector Centrality], \">= \" & N29) - COUNTIF(Vertices[Eigenvector Centrality], \">=\" & N30)","v":0},0,{"$f":"COUNTIF(Vertices[PageRank], \">= \" & P29) - COUNTIF(Vertices[PageRank], \">=\" & P30)","v":0},0,{"$f":"COUNTIF(Vertices[Clustering Coefficient], \">= \" & R29) - COUNTIF(Vertices[Clustering Coefficient], \">=\" & R30)","v":0},96.715116279069818,4]
[null,null,null,0,{"$f":"COUNTIF(Vertices[Degree], \">= \" & D30) - COUNTIF(Vertices[Degree], \">=\" & D31)","v":0},0,{"$f":"COUNTIF(Vertices[In-Degree], \">= \" & F30) - COUNTIF(Vertices[In-Degree], \">=\" & F31)","v":0},0,{"$f":"COUNTIF(Vertices[Out-Degree], \">= \" & H30) - COUNTIF(Vertices[Out-Degree], \">=\" & H31)","v":0},0,{"$f":"COUNTIF(Vertices[Betweenness Centrality], \">= \" & J30) - COUNTIF(Vertices[Betweenness Centrality], \">=\" & J31)","v":0},0,{"$f":"COUNTIF(Vertices[Closeness Centrality], \">= \" & L30) - COUNTIF(Vertices[Closeness Centrality], \">=\" & L31)","v":0},0,{"$f":"COUNTIF(Vertices[Eigenvector Centrality], \">= \" & N30) - COUNTIF(Vertices[Eigenvector Centrality], \">=\" & N31)","v":0},0,{"$f":"COUNTIF(Vertices[PageRank], \">= \" & P30) - COUNTIF(Vertices[PageRank], \">=\" & P31)","v":0},0,{"$f":"COUNTIF(Vertices[Clustering Coefficient], \">= \" & R30) - COUNTIF(Vertices[Clustering Coefficient], \">=\" & R31)","v":0},100.18604651162796,2]
[null,null,null,0,{"$f":"COUNTIF(Vertices[Degree], \">= \" & D31) - COUNTIF(Vertices[Degree], \">=\" & D32)","v":0},0,{"$f":"COUNTIF(Vertices[In-Degree], \">= \" & F31) - COUNTIF(Vertices[In-Degree], \">=\" & F32)","v":0},0,{"$f":"COUNTIF(Vertices[Out-Degree], \">= \" & H31) - COUNTIF(Vertices[Out-Degree], \">=\" & H32)","v":0},0,{"$f":"COUNTIF(Vertices[Betweenness Centrality], \">= \" & J31) - COUNTIF(Vertices[Betweenness Centrality], \">=\" & J32)","v":0},0,{"$f":"COUNTIF(Vertices[Closeness Centrality], \">= \" & L31) - COUNTIF(Vertices[Closeness Centrality], \">=\" & L32)","v":0},0,{"$f":"COUNTIF(Vertices[Eigenvector Centrality], \">= \" & N31) - COUNTIF(Vertices[Eigenvector Centrality], \">=\" & N32)","v":0},0,{"$f":"COUNTIF(Vertices[PageRank], \">= \" & P31) - COUNTIF(Vertices[PageRank], \">=\" & P32)","v":0},0,{"$f":"COUNTIF(Vertices[Clustering Coefficient], \">= \" & R31) - COUNTIF(Vertices[Clustering Coefficient], \">=\" & R32)","v":0},103.65697674418611,3]
[null,null,null,0,{"$f":"COUNTIF(Vertices[Degree], \">= \" & D32) - COUNTIF(Vertices[Degree], \">=\" & D33)","v":0},0,{"$f":"COUNTIF(Vertices[In-Degree], \">= \" & F32) - COUNTIF(Vertices[In-Degree], \">=\" & F33)","v":0},0,{"$f":"COUNTIF(Vertices[Out-Degree], \">= \" & H32) - COUNTIF(Vertices[Out-Degree], \">=\" & H33)","v":0},0,{"$f":"COUNTIF(Vertices[Betweenness Centrality], \">= \" & J32) - COUNTIF(Vertices[Betweenness Centrality], \">=\" & J33)","v":0},0,{"$f":"COUNTIF(Vertices[Closeness Centrality], \">= \" & L32) - COUNTIF(Vertices[Closeness Centrality], \">=\" & L33)","v":0},0,{"$f":"COUNTIF(Vertices[Eigenvector Centrality], \">= \" & N32) - COUNTIF(Vertices[Eigenvector Centrality], \">=\" & N33)","v":0},0,{"$f":"COUNTIF(Vertices[PageRank], \">= \" & P32) - COUNTIF(Vertices[PageRank], \">=\" & P33)","v":0},0,{"$f":"COUNTIF(Vertices[Clustering Coefficient], \">= \" & R32) - COUNTIF(Vertices[Clustering Coefficient], \">=\" & R33)","v":0},107.12790697674426,1]
[null,null,null,0,{"$f":"COUNTIF(Vertices[Degree], \">= \" & D33) - COUNTIF(Vertices[Degree], \">=\" & D34)","v":0},0,{"$f":"COUNTIF(Vertices[In-Degree], \">= \" & F33) - COUNTIF(Vertices[In-Degree], \">=\" & F34)","v":0},0,{"$f":"COUNTIF(Vertices[Out-Degree], \">= \" & H33) - COUNTIF(Vertices[Out-Degree], \">=\" & H34)","v":0},0,{"$f":"COUNTIF(Vertices[Betweenness Centrality], \">= \" & J33) - COUNTIF(Vertices[Betweenness Centrality], \">=\" & J34)","v":0},0,{"$f":"COUNTIF(Vertices[Closeness Centrality], \">= \" & L33) - COUNTIF(Vertices[Closeness Centrality], \">=\" & L34)","v":0},0,{"$f":"COUNTIF(Vertices[Eigenvector Centrality], \">= \" & N33) - COUNTIF(Vertices[Eigenvector Centrality], \">=\" & N34)","v":0},0,{"$f":"COUNTIF(Vertices[PageRank], \">= \" & P33) - COUNTIF(Vertices[PageRank], \">=\" & P34)","v":0},0,{"$f":"COUNTIF(Vertices[Clustering Coefficient], \">= \" & R33) - COUNTIF(Vertices[Clustering Coefficient], \">=\" & R34)","v":0},110.5988372093024,2]
[null,null,null,0,{"$f":"COUNTIF(Vertices[Degree], \">= \" & D34) - COUNTIF(Vertices[Degree], \">=\" & D35)","v":0},0,{"$f":"COUNTIF(Vertices[In-Degree], \">= \" & F34) - COUNTIF(Vertices[In-Degree], \">=\" & F35)","v":0},0,{"$f":"COUNTIF(Vertices[Out-Degree], \">= \" & H34) - COUNTIF(Vertices[Out-Degree], \">=\" & H35)","v":0},0,{"$f":"COUNTIF(Vertices[Betweenness Centrality], \">= \" & J34) - COUNTIF(Vertices[Betweenness Centrality], \">=\" & J35)","v":0},0,{"$f":"COUNTIF(Vertices[Closeness Centrality], \">= \" & L34) - COUNTIF(Vertices[Closeness Centrality], \">=\" & L35)","v":0},0,{"$f":"COUNTIF(Vertices[Eigenvector Centrality], \">= \" & N34) - COUNTIF(Vertices[Eigenvector Centrality], \">=\" & N35)","v":0},0,{"$f":"COUNTIF(Vertices[PageRank], \">= \" & P34) - COUNTIF(Vertices[PageRank], \">=\" & P35)","v":0},0,{"$f":"COUNTIF(Vertices[Clustering Coefficient], \">= \" & R34) - COUNTIF(Vertices[Clustering Coefficient], \">=\" & R35)","v":0},114.06976744186055,4]
[null,null,null,0,{"$f":"COUNTIF(Vertices[Degree], \">= \" & D35) - COUNTIF(Vertices[Degree], \">=\" & D36)","v":0},0,{"$f":"COUNTIF(Vertices[In-Degree], \">= \" & F35) - COUNTIF(Vertices[In-Degree], \">=\" & F36)","v":0},0,{"$f":"COUNTIF(Vertices[Out-Degree], \">= \" & H35) - COUNTIF(Vertices[Out-Degree], \">=\" & H36)","v":0},0,{"$f":"COUNTIF(Vertices[Betweenness Centrality], \">= \" & J35) - COUNTIF(Vertices[Betweenness Centrality], \">=\" & J36)","v":0},0,{"$f":"COUNTIF(Vertices[Closeness Centrality], \">= \" & L35) - COUNTIF(Vertices[Closeness Centrality], \">=\" & L36)","v":0},0,{"$f":"COUNTIF(Vertices[Eigenvector Centrality], \">= \" & N35) - COUNTIF(Vertices[Eigenvector Centrality], \">=\" & N36)","v":0},0,{"$f":"COUNTIF(Vertices[PageRank], \">= \" & P35) - COUNTIF(Vertices[PageRank], \">=\" & P36)","v":0},0,{"$f":"COUNTIF(Vertices[Clustering Coefficient], \">= \" & R35) - COUNTIF(Vertices[Clustering Coefficient], \">=\" & R36)","v":0},117.54069767441869,1]
[null,null,null,0,{"$f":"COUNTIF(Vertices[Degree], \">= \" & D36) - COUNTIF(Vertices[Degree], \">=\" & D37)","v":0},0,{"$f":"COUNTIF(Vertices[In-Degree], \">= \" & F36) - COUNTIF(Vertices[In-Degree], \">=\" & F37)","v":0},0,{"$f":"COUNTIF(Vertices[Out-Degree], \">= \" & H36) - COUNTIF(Vertices[Out-Degree], \">=\" & H37)","v":0},0,{"$f":"COUNTIF(Vertices[Betweenness Centrality], \">= \" & J36) - COUNTIF(Vertices[Betweenness Centrality], \">=\" & J37)","v":0},0,{"$f":"COUNTIF(Vertices[Closeness Centrality], \">= \" & L36) - COUNTIF(Vertices[Closeness Centrality], \">=\" & L37)","v":0},0,{"$f":"COUNTIF(Vertices[Eigenvector Centrality], \">= \" & N36) - COUNTIF(Vertices[Eigenvector Centrality], \">=\" & N37)","v":0},0,{"$f":"COUNTIF(Vertices[PageRank], \">= \" & P36) - COUNTIF(Vertices[PageRank], \">=\" & P37)","v":0},0,{"$f":"COUNTIF(Vertices[Clustering Coefficient], \">= \" & R36) - COUNTIF(Vertices[Clustering Coefficient], \">=\" & R37)","v":0},121.01162790697684,2]
[null,null,null,0,{"$f":"COUNTIF(Vertices[Degree], \">= \" & D37) - COUNTIF(Vertices[Degree], \">=\" & D38)","v":0},0,{"$f":"COUNTIF(Vertices[In-Degree], \">= \" & F37) - COUNTIF(Vertices[In-Degree], \">=\" & F38)","v":0},0,{"$f":"COUNTIF(Vertices[Out-Degree], \">= \" & H37) - COUNTIF(Vertices[Out-Degree], \">=\" & H38)","v":0},0,{"$f":"COUNTIF(Vertices[Betweenness Centrality], \">= \" & J37) - COUNTIF(Vertices[Betweenness Centrality], \">=\" & J38)","v":0},0,{"$f":"COUNTIF(Vertices[Closeness Centrality], \">= \" & L37) - COUNTIF(Vertices[Closeness Centrality], \">=\" & L38)","v":0},0,{"$f":"COUNTIF(Vertices[Eigenvector Centrality], \">= \" & N37) - COUNTIF(Vertices[Eigenvector Centrality], \">=\" & N38)","v":0},0,{"$f":"COUNTIF(Vertices[PageRank], \">= \" & P37) - COUNTIF(Vertices[PageRank], \">=\" & P38)","v":0},0,{"$f":"COUNTIF(Vertices[Clustering Coefficient], \">= \" & R37) - COUNTIF(Vertices[Clustering Coefficient], \">=\" & R38)","v":0},124.48255813953499,5]
[null,null,null,0,{"$f":"COUNTIF(Vertices[Degree], \">= \" & D38) - COUNTIF(Vertices[Degree], \">=\" & D39)","v":0},0,{"$f":"COUNTIF(Vertices[In-Degree], \">= \" & F38) - COUNTIF(Vertices[In-Degree], \">=\" & F39)","v":0},0,{"$f":"COUNTIF(Vertices[Out-Degree], \">= \" & H38) - COUNTIF(Vertices[Out-Degree], \">=\" & H39)","v":0},0,{"$f":"COUNTIF(Vertices[Betweenness Centrality], \">= \" & J38) - COUNTIF(Vertices[Betweenness Centrality], \">=\" & J39)","v":0},0,{"$f":"COUNTIF(Vertices[Closeness Centrality], \">= \" & L38) - COUNTIF(Vertices[Closeness Centrality], \">=\" & L39)","v":0},0,{"$f":"COUNTIF(Vertices[Eigenvector Centrality], \">= \" & N38) - COUNTIF(Vertices[Eigenvector Centrality], \">=\" & N39)","v":0},0,{"$f":"COUNTIF(Vertices[PageRank], \">= \" & P38) - COUNTIF(Vertices[PageRank], \">=\" & P39)","v":0},0,{"$f":"COUNTIF(Vertices[Clustering Coefficient], \">= \" & R38) - COUNTIF(Vertices[Clustering Coefficient], \">=\" & R39)","v":0},127.95348837209313,5]
[null,null,null,0,{"$f":"COUNTIF(Vertices[Degree], \">= \" & D39) - COUNTIF(Vertices[Degree], \">=\" & D40)","v":0},0,{"$f":"COUNTIF(Vertices[In-Degree], \">= \" & F39) - COUNTIF(Vertices[In-Degree], \">=\" & F40)","v":0},0,{"$f":"COUNTIF(Vertices[Out-Degree], \">= \" & H39) - COUNTIF(Vertices[Out-Degree], \">=\" & H40)","v":0},0,{"$f":"COUNTIF(Vertices[Betweenness Centrality], \">= \" & J39) - COUNTIF(Vertices[Betweenness Centrality], \">=\" & J40)","v":0},0,{"$f":"COUNTIF(Vertices[Closeness Centrality], \">= \" & L39) - COUNTIF(Vertices[Closeness Centrality], \">=\" & L40)","v":0},0,{"$f":"COUNTIF(Vertices[Eigenvector Centrality], \">= \" & N39) - COUNTIF(Vertices[Eigenvector Centrality], \">=\" & N40)","v":0},0,{"$f":"COUNTIF(Vertices[PageRank], \">= \" & P39) - COUNTIF(Vertices[PageRank], \">=\" & P40)","v":0},0,{"$f":"COUNTIF(Vertices[Clustering Coefficient], \">= \" & R39) - COUNTIF(Vertices[Clustering Coefficient], \">=\" & R40)","v":0},131.42441860465127,5]
[null,null,null,0,{"$f":"COUNTIF(Vertices[Degree], \">= \" & D40) - COUNTIF(Vertices[Degree], \">=\" & D41)","v":0},0,{"$f":"COUNTIF(Vertices[In-Degree], \">= \" & F40) - COUNTIF(Vertices[In-Degree], \">=\" & F41)","v":0},0,{"$f":"COUNTIF(Vertices[Out-Degree], \">= \" & H40) - COUNTIF(Vertices[Out-Degree], \">=\" & H41)","v":0},0,{"$f":"COUNTIF(Vertices[Betweenness Centrality], \">= \" & J40) - COUNTIF(Vertices[Betweenness Centrality], \">=\" & J41)","v":0},0,{"$f":"COUNTIF(Vertices[Closeness Centrality], \">= \" & L40) - COUNTIF(Vertices[Closeness Centrality], \">=\" & L41)","v":0},0,{"$f":"COUNTIF(Vertices[Eigenvector Centrality], \">= \" & N40) - COUNTIF(Vertices[Eigenvector Centrality], \">=\" & N41)","v":0},0,{"$f":"COUNTIF(Vertices[PageRank], \">= \" & P40) - COUNTIF(Vertices[PageRank], \">=\" & P41)","v":0},0,{"$f":"COUNTIF(Vertices[Clustering Coefficient], \">= \" & R40) - COUNTIF(Vertices[Clustering Coefficient], \">=\" & R41)","v":0},134.89534883720941,5]
[null,null,null,0,{"$f":"COUNTIF(Vertices[Degree], \">= \" & D41) - COUNTIF(Vertices[Degree], \">=\" & D42)","v":0},0,{"$f":"COUNTIF(Vertices[In-Degree], \">= \" & F41) - COUNTIF(Vertices[In-Degree], \">=\" & F42)","v":0},0,{"$f":"COUNTIF(Vertices[Out-Degree], \">= \" & H41) - COUNTIF(Vertices[Out-Degree], \">=\" & H42)","v":0},0,{"$f":"COUNTIF(Vertices[Betweenness Centrality], \">= \" & J41) - COUNTIF(Vertices[Betweenness Centrality], \">=\" & J42)","v":0},0,{"$f":"COUNTIF(Vertices[Closeness Centrality], \">= \" & L41) - COUNTIF(Vertices[Closeness Centrality], \">=\" & L42)","v":0},0,{"$f":"COUNTIF(Vertices[Eigenvector Centrality], \">= \" & N41) - COUNTIF(Vertices[Eigenvector Centrality], \">=\" & N42)","v":0},0,{"$f":"COUNTIF(Vertices[PageRank], \">= \" & P41) - COUNTIF(Vertices[PageRank], \">=\" & P42)","v":0},0,{"$f":"COUNTIF(Vertices[Clustering Coefficient], \">= \" & R41) - COUNTIF(Vertices[Clustering Coefficient], \">=\" & R42)","v":0},138.36627906976756,2]
[null,null,null,0,{"$f":"COUNTIF(Vertices[Degree], \">= \" & D42) - COUNTIF(Vertices[Degree], \">=\" & D43)","v":0},0,{"$f":"COUNTIF(Vertices[In-Degree], \">= \" & F42) - COUNTIF(Vertices[In-Degree], \">=\" & F43)","v":0},0,{"$f":"COUNTIF(Vertices[Out-Degree], \">= \" & H42) - COUNTIF(Vertices[Out-Degree], \">=\" & H43)","v":0},0,{"$f":"COUNTIF(Vertices[Betweenness Centrality], \">= \" & J42) - COUNTIF(Vertices[Betweenness Centrality], \">=\" & J43)","v":0},0,{"$f":"COUNTIF(Vertices[Closeness Centrality], \">= \" & L42) - COUNTIF(Vertices[Closeness Centrality], \">=\" & L43)","v":0},0,{"$f":"COUNTIF(Vertices[Eigenvector Centrality], \">= \" & N42) - COUNTIF(Vertices[Eigenvector Centrality], \">=\" & N43)","v":0},0,{"$f":"COUNTIF(Vertices[PageRank], \">= \" & P42) - COUNTIF(Vertices[PageRank], \">=\" & P43)","v":0},0,{"$f":"COUNTIF(Vertices[Clustering Coefficient], \">= \" & R42) - COUNTIF(Vertices[Clustering Coefficient], \">=\" & R43)","v":0},141.8372093023257,3]
["Minimum Degree",{"$f":"IF(COUNT(Vertices[Degree])>0, D2, NoMetricMessage)","v":"Not Available"},null,0,{"$f":"COUNTIF(Vertices[Degree], \">= \" & D43) - COUNTIF(Vertices[Degree], \">=\" & D44)","v":0},0,{"$f":"COUNTIF(Vertices[In-Degree], \">= \" & F43) - COUNTIF(Vertices[In-Degree], \">=\" & F44)","v":0},0,{"$f":"COUNTIF(Vertices[Out-Degree], \">= \" & H43) - COUNTIF(Vertices[Out-Degree], \">=\" & H44)","v":0},0,{"$f":"COUNTIF(Vertices[Betweenness Centrality], \">= \" & J43) - COUNTIF(Vertices[Betweenness Centrality], \">=\" & J44)","v":0},0,{"$f":"COUNTIF(Vertices[Closeness Centrality], \">= \" & L43) - COUNTIF(Vertices[Closeness Centrality], \">=\" & L44)","v":0},0,{"$f":"COUNTIF(Vertices[Eigenvector Centrality], \">= \" & N43) - COUNTIF(Vertices[Eigenvector Centrality], \">=\" & N44)","v":0},0,{"$f":"COUNTIF(Vertices[PageRank], \">= \" & P43) - COUNTIF(Vertices[PageRank], \">=\" & P44)","v":0},0,{"$f":"COUNTIF(Vertices[Clustering Coefficient], \">= \" & R43) - COUNTIF(Vertices[Clustering Coefficient], \">=\" & R44)","v":0},145.30813953488385,2]
["Maximum Degree",{"$f":"IF(COUNT(Vertices[Degree])>0, D45, NoMetricMessage)","v":"Not Available"},null,0,{"$f":"COUNTIF(Vertices[Degree], \">= \" & D44) - COUNTIF(Vertices[Degree], \">=\" & D45)","v":0},0,{"$f":"COUNTIF(Vertices[In-Degree], \">= \" & F44) - COUNTIF(Vertices[In-Degree], \">=\" & F45)","v":0},0,{"$f":"COUNTIF(Vertices[Out-Degree], \">= \" & H44) - COUNTIF(Vertices[Out-Degree], \">=\" & H45)","v":0},0,{"$f":"COUNTIF(Vertices[Betweenness Centrality], \">= \" & J44) - COUNTIF(Vertices[Betweenness Centrality], \">=\" & J45)","v":0},0,{"$f":"COUNTIF(Vertices[Closeness Centrality], \">= \" & L44) - COUNTIF(Vertices[Closeness Centrality], \">=\" & L45)","v":0},0,{"$f":"COUNTIF(Vertices[Eigenvector Centrality], \">= \" & N44) - COUNTIF(Vertices[Eigenvector Centrality], \">=\" & N45)","v":0},0,{"$f":"COUNTIF(Vertices[PageRank], \">= \" & P44) - COUNTIF(Vertices[PageRank], \">=\" & P45)","v":0},0,{"$f":"COUNTIF(Vertices[Clustering Coefficient], \">= \" & R44) - COUNTIF(Vertices[Clustering Coefficient], \">=\" & R45)","v":0},148.779069767442,3]
["Average Degree",{"$f":"IFERROR(AVERAGE(Vertices[Degree]),NoMetricMessage)","v":"Not Available"},null,{"$f":"MAX(Vertices[Degree])","v":0},{"$f":"COUNTIF(Vertices[Degree], \">= \" & D45) - COUNTIF(Vertices[Degree], \">=\" & D46)","v":0},{"$f":"MAX(Vertices[In-Degree])","v":0},{"$f":"COUNTIF(Vertices[In-Degree], \">= \" & F45) - COUNTIF(Vertices[In-Degree], \">=\" & F46)","v":0},{"$f":"MAX(Vertices[Out-Degree])","v":0},{"$f":"COUNTIF(Vertices[Out-Degree], \">= \" & H45) - COUNTIF(Vertices[Out-Degree], \">=\" & H46)","v":0},{"$f":"MAX(Vertices[Betweenness Centrality])","v":0},{"$f":"COUNTIF(Vertices[Betweenness Centrality], \">= \" & J45) - COUNTIF(Vertices[Betweenness Centrality], \">=\" & J46)","v":0},{"$f":"MAX(Vertices[Closeness Centrality])","v":0},{"$f":"COUNTIF(Vertices[Closeness Centrality], \">= \" & L45) - COUNTIF(Vertices[Closeness Centrality], \">=\" & L46)","v":0},{"$f":"MAX(Vertices[Eigenvector Centrality])","v":0},{"$f":"COUNTIF(Vertices[Eigenvector Centrality], \">= \" & N45) - COUNTIF(Vertices[Eigenvector Centrality], \">=\" & N46)","v":0},{"$f":"MAX(Vertices[PageRank])","v":0},{"$f":"COUNTIF(Vertices[PageRank], \">= \" & P45) - COUNTIF(Vertices[PageRank], \">=\" & P46)","v":0},{"$f":"MAX(Vertices[Clustering Coefficient])","v":0},{"$f":"COUNTIF(Vertices[Clustering Coefficient], \">= \" & R45) - COUNTIF(Vertices[Clustering Coefficient], \">=\" & R46)","v":0},{"$f":"MAX(INDIRECT(DynamicFilterSourceColumnRange))","v":152.25},1]
["Median Degree",{"$f":"IFERROR(MEDIAN(Vertices[Degree]),NoMetricMessage)","v":"Not Available"}]
{"$rows_empty":10}
["Minimum In-Degree",{"$f":"IF(COUNT(Vertices[In-Degree])>0, F2, NoMetricMessage)","v":"Not Available"}]
["Maximum In-Degree",{"$f":"IF(COUNT(Vertices[In-Degree])>0, F45, NoMetricMessage)","v":"Not Available"}]
["Average In-Degree",{"$f":"IFERROR(AVERAGE(Vertices[In-Degree]),NoMetricMessage)","v":"Not Available"}]
["Median In-Degree",{"$f":"IFERROR(MEDIAN(Vertices[In-Degree]),NoMetricMessage)","v":"Not Available"}]
{"$rows_empty":10}
["Minimum Out-Degree",{"$f":"IF(COUNT(Vertices[Out-Degree])>0, H2, NoMetricMessage)","v":"Not Available"}]
["Maximum Out-Degree",{"$f":"IF(COUNT(Vertices[Out-Degree])>0, H45, NoMetricMessage)","v":"Not Available"}]
["Average Out-Degree",{"$f":"IFERROR(AVERAGE(Vertices[Out-Degree]),NoMetricMessage)","v":"Not Available"}]
["Median Out-Degree",{"$f":"IFERROR(MEDIAN(Vertices[Out-Degree]),NoMetricMessage)","v":"Not Available"}]
{"$rows_empty":10}
["Minimum Betweenness Centrality",{"$f":"IF(COUNT(Vertices[Betweenness Centrality])>0, J2, NoMetricMessage)","v":"Not Available"}]
["Maximum Betweenness Centrality",{"$f":"IF(COUNT(Vertices[Betweenness Centrality])>0, J45, NoMetricMessage)","v":"Not Available"}]
["Average Betweenness Centrality",{"$f":"IFERROR(AVERAGE(Vertices[Betweenness Centrality]),NoMetricMessage)","v":"Not Available"}]
["Median Betweenness Centrality",{"$f":"IFERROR(MEDIAN(Vertices[Betweenness Centrality]),NoMetricMessage)","v":"Not Available"}]
{"$rows_empty":10}
["Minimum Closeness Centrality",{"$f":"IF(COUNT(Vertices[Closeness Centrality])>0, L2, NoMetricMessage)","v":"Not Available"}]
["Maximum Closeness Centrality",{"$f":"IF(COUNT(Vertices[Closeness Centrality])>0, L45, NoMetricMessage)","v":"Not Available"}]
["Average Closeness Centrality",{"$f":"IFERROR(AVERAGE(Vertices[Closeness Centrality]),NoMetricMessage)","v":"Not Available"}]
["Median Closeness Centrality",{"$f":"IFERROR(MEDIAN(Vertices[Closeness Centrality]),NoMetricMessage)","v":"Not Available"}]
{"$rows_empty":10}
["Minimum Eigenvector Centrality",{"$f":"IF(COUNT(Vertices[Eigenvector Centrality])>0, N2, NoMetricMessage)","v":"Not Available"}]
["Maximum Eigenvector Centrality",{"$f":"IF(COUNT(Vertices[Eigenvector Centrality])>0, N45, NoMetricMessage)","v":"Not Available"}]
["Average Eigenvector Centrality",{"$f":"IFERROR(AVERAGE(Vertices[Eigenvector Centrality]),NoMetricMessage)","v":"Not Available"}]
["Median Eigenvector Centrality",{"$f":"IFERROR(MEDIAN(Vertices[Eigenvector Centrality]),NoMetricMessage)","v":"Not Available"}]
{"$rows_empty":10}
["Minimum PageRank",{"$f":"IF(COUNT(Vertices[PageRank])>0, P2, NoMetricMessage)","v":"Not Available"}]
["Maximum PageRank",{"$f":"IF(COUNT(Vertices[PageRank])>0, P45, NoMetricMessage)","v":"Not Available"}]
["Average PageRank",{"$f":"IFERROR(AVERAGE(Vertices[PageRank]),NoMetricMessage)","v":"Not Available"}]
["Median PageRank",{"$f":"IFERROR(MEDIAN(Vertices[PageRank]),NoMetricMessage)","v":"Not Available"}]
{"$rows_empty":10}
["Minimum Clustering Coefficient",{"$f":"IF(COUNT(Vertices[Clustering Coefficient])>0, R2, NoMetricMessage)","v":"Not Available"}]
["Maximum Clustering Coefficient",{"$f":"IF(COUNT(Vertices[Clustering Coefficient])>0, R45, NoMetricMessage)","v":"Not Available"}]
["Average Clustering Coefficient",{"$f":"IFERROR(AVERAGE(Vertices[Clustering Coefficient]),NoMetricMessage)","v":"Not Available"}]
["Median Clustering Coefficient",{"$f":"IFERROR(MEDIAN(Vertices[Clustering Coefficient]),NoMetricMessage)","v":"Not Available"}]

{"sheet":"Misc","index":12,"n_rows":23,"n_cols":18,"rows_kept":23,"cut":false,"hidden":true,"merged":[]}
["Valid Edge Visibilities","Valid Edge Styles","Valid Vertex Visibilities","Valid Vertex Shapes","Valid Group Shapes","Valid Group Visibilities","Valid Booleans Default False","Valid Vertex Label Positions",null,"Per-Workbook Setting","Value",null,"Table Name","Column Name","Selected Minimum","Selected Maximum"]
["Show","Solid","Show if in an Edge","Circle","Circle","Show","No","Nowhere",null,"Template Version",105,null,"Vertices","X",276,9421.9912109375]
["Skip","Dash","Skip","Disk","Disk","Skip","Yes","Top Left",null,"Graph Directedness","Directed",null,"Vertices","Y",4378.07958984375,5620.92138671875]
["Hide","Dot","Hide","Sphere","Sphere","Hide",0,"Top Center",null,"Auto Layout on Open",null,null,"Vertices","Onset",1,150.75]
[1,"Dash Dot","Show","Square","Square",1,1,"Top Right",null,"Workbook Settings 1","<?xml version=\"1.0\" encoding=\"utf-8\"?>\r\n<configuration>\r\n  <configSections>\r\n    <sectionGroup name=\"userSettings\" type=\"System.Configuration.UserSettingsGroup, System, Version=2.0.0.0, Culture=neutral, PublicKeyToken=b77a5c561934e089\">\r\n      <section name=\"ColumnGroupUserSettings\" type=\"System.Configuration.ClientSettingsSection, System, Version=2.0.0.0, Culture=neutral, PublicKeyToken=b77a5c561934e089\" allowExeDefinition=\"MachineToLocalUser\" requirePermission=\"false\" />\r\n      <section name=\"GraphMetricUserSettings\" type=\"System.Configuration.ClientSettingsSection, System, Version=2.0.0.0, Culture=neutral, PublicKeyToken=b77a5c561934e089\" allowExeDefinition=\"MachineToLocalUser\" requirePermission=\"false\" />\r\n      <section name=\"MotifUserSettings\" type=\"System.Configuration.ClientSettingsSection, System, Version=2.0.0.0, Culture=neutral, PublicKeyToken=b77a5c561934e089\" allowExeDefinition=\"MachineToLocalUser\" requirePermission=\"false\" />\r\n      <section name=\"GraphImageUserSettings2\" type=\"System.Configuration.ClientSettingsSection, System, Version=2.0.0.0, Culture=neutral, PublicKeyToken=b77a5c561934e089\" allowExeDefinition=\"MachineToLocalUser\" requirePermission=\"false\" />\r\n      <section name=\"GroupUserSettings\" type=\"System.Configuration.ClientSettingsSection, System, Version=2.0.0.0, Culture=neutral, PublicKeyToken=b77a5c561934e089\" allowExeDefinition=\"MachineToLocalUser\" requirePermission=\"false\" />\r\n      <section name=\"AutomateTasksUserSettings\" type=\"System.Configuration.ClientSettingsSection, System, Version=2.0.0.0, Culture=neutral, PublicKeyToken=b77a5c561934e089\" allowExeDefinition=\"MachineToLocalUser\" requirePermission=\"false\" />\r\n      <section name=\"DynamicFiltersUserSettings\" type=\"System.Configuration.ClientSettingsSection, System, Version=2.0.0.0, Culture=neutral, PublicKeyToken=b77a5c561934e089\" allowExeDefinition=\"MachineToLocalUser\" requirePermission=\"false\" />\r\n      <section name=\"LayoutUserSettings\" type=\"System.Configuration.ClientSettingsSection, System, Version=2.0.0.0, Culture=neutral, PublicKeyToken=b77a5c561934e089\" allowExeDefinition=\"MachineToLocalUser\" requirePermission=\"false\" />\r\n      <section name=\"AutoFillUserSettings3\" type=\"System.Configuration.ClientSettingsSection, System, Version=2.0.0.0, Culture=neutral, PublicKeyToken=b77a5c561934e089\" allowExeDefinition=\"MachineToLocalUser\" requirePermission=\"false\" />\r\n      <section name=\"GeneralUserSettings4\" type=\"System.Configuration.ClientSettingsSection, System, Version=2.0.0.0, Culture=neutral, PublicKeyToken=b77a5c561934e089\" allowExeDefinition=\"MachineToLocalUser\" requirePermission=\"false\" />\r\n      <section name=\"GraphZoomAndScaleUserSettings\" type=\"System.Configuration.ClientSettingsSection, System, Version=2.0.0.0, Culture=neutral, PublicKeyToken=b77a5c561934e089\" allowExeDefinition=\"MachineToLocalUser\" requirePermission=\"false\" />\r\n    </sectionGroup>\r\n  </configSections>\r\n  <userSettings>\r\n    <ColumnGroupUserSettings>\r\n      <setting name=\"ColumnGroupsToShow\" serializeAs=\"String\">\r\n        <value>EdgeDoNotHide, EdgeVisualAttributes, EdgeLabels, EdgeGraphMetrics, EdgeOtherColumns, VertexDoNotHide, VertexVisualAttributes, VertexGraphMetrics, VertexLabels, VertexOtherColumns, GroupDoNotHide, GroupVisualAttributes, GroupLabels, GroupGraphMetrics, GroupEdgeDoNotHide, GroupEdgeGraphMetrics</value>\r\n      </setting>\r\n    </ColumnGroupUserSettings>\r\n    <GraphMetricUserSettings>\r\n      <setting name=\"GraphMetricsToCalculate\" serializeAs=\"String\">\r\n        <value>BrandesFastCentralities, OverallMetrics</value>\r\n      </setting>\r\n    </GraphMetricUserSettings>\r\n    <MotifUserSettings>\r\n      <setting name=\"CliqueMaximumMemberVertices\" serializeAs=\"String\">\r\n        <value>9999</value>\r\n      </setting>\r\n      <setting name=\"CliqueMinimumMemberVertices\" serializeAs=\"String\">\r\n        <value>4</value>\r\n      </setting>\r\n      <setting name=\"MotifsToCalculate\" serializeAs=\"String\">\r\n        <value>DConnector</value>\r\n      </setting>\r\n      <setting name=\"DConnectorMaximumAnchorVertices\" serializeAs=\"String\">\r\n        <value>9999</value>\r\n      </setting>\r\n      <setting name=\"DConnectorMinimumAnchorVertices\" serializeAs=\"String\">\r\n        <value>2</value>\r\n      </setting>\r\n    </MotifUserSettings>\r\n    <GraphImageUserSettings2>\r\n      <setting name=\"ImageSize\" serializeAs=\"String\">\r\n        <value>1000, 673</value>\r\n      </setting>\r\n      <setting name=\"IncludeFooter\" serializeAs=\"String\">\r\n        <value>False</value>\r\n      </setting>\r\n      <setting name=\"IncludeHeader\" serializeAs=\"String\">\r\n        <value>False</value>\r\n      </setting>\r\n      <setting name=\"UseControlSize\" serializeAs=\"String\">\r\n        <value>False</value>\r\n      </setting>\r\n      <setting name=\"FooterText\" serializeAs=\"String\">\r\n        <value>Created with NodeXL (http://nodexl.codeplex.com)</value>\r\n      </setting>\r\n      <setting name=\"HeaderFooterFont\" serializeAs=\"String\">\r\n        <value>Microsoft Sans Serif, 8.25pt</value>\r\n      </setting>\r\n      <setting name=\"HeaderText\" serializeAs=\"String\">\r\n        <value />\r\n      </setting>\r\n    </GraphImageUserSettings2>\r\n    <GroupUserSettings>\r\n      <setting name=\"ReadGroups\" serializeAs=\"String\">\r\n        <value>True</value>\r\n      </setting>\r\n      <setting name=\"ReadVertexShapeFromGroups\" serializeAs=\"String\">\r\n        <value>False</value>\r\n      </setting>\r\n      <setting name=\"ReadVertexColorFromGroups\" serializeAs=\"String\">\r\n        <value>False</value>\r\n      </setting>\r\n    </GroupUserSettings>\r\n    <AutomateTasksUserSettings>\r\n      <setting name=\"FolderToAutomate\" serializeAs=\"String\">\r\n        <value />\r\n      </setting>\r\n      <setting name=\"TasksToRun\" serializeAs=\"String\">\r\n        <value>AutoFillWorkbook, ReadWorkbook</value>\r\n      </setting>\r\n      <setting name=\"AutomateThisWorkbookOnly\" serializeAs=\"String\">\r\n        <value>True</value>\r\n      </setting>\r\n    </AutomateTasksUserSettings>\r\n    <DynamicFiltersUserSettings>\r\n      <setting name=\"FilterNonNume",null,"Vertices","Offset",3,152.25]
[0,"Dash Dot Dot",1,"Solid Square","Solid Square",0,null,"Middle Left",null,"Workbook Settings Cell Count",3,null,"Vertices","Type",1.1000000000000001,8.1,null,"The empty chart above is used to create histogram images for dynamic filters.  It is associated with two columns in the HistogramBins table on the Overall Metrics worksheet, and on the HistogramProperties table on that worksheet.  The chart is on this worksheet instead of the more logical Overall Metrics worksheet because the chart must be visible for a histogram image to be created.  If the chart where in Overall Metrics in a visible range the user would see it, whereas the user never sees this Misc worksheet because the entire worksheet is hidden. "]
[2,1,0,"Diamond","Diamond",2,null,"Middle Center",null,"Graph History","LayoutAlgorithm░The graph was laid out using the Sugiyama layout algorithm.▓GraphDirectedness░The graph is directed.▓GroupingDescription░The graph's vertices were grouped by connected component."]
[null,2,2,"Solid Diamond","Solid Diamond",null,null,"Middle Right",null,"Autofill Workbook Results","S▓0▓1▓0▓True▓64, 0, 64▓128, 255, 0▓▓N▓0▓1▓0▓1▓2▓False▓▓0▓0▓0▓0▓0▓False▓Type▓0▓1▓0▓False▓241, 137, 4▓46, 7, 195▓1.1░2.1░1.4░1.5░1.6░3.1░4.1░5.1░6.1░7.1░1.2░1.3░1.7░1.8░8.1▓▓0▓0▓0▓0▓0▓False▓▓0▓0▓0▓0▓0▓False▓▓0▓0▓0▓0▓0▓False▓▓0▓0▓0▓0▓0▓False"]
[null,3,4,"Triangle","Triangle",null,null,"Bottom Left",null,"Workbook Settings 2","ricCells\" serializeAs=\"String\">\r\n        <value>False</value>\r\n      </setting>\r\n      <setting name=\"FilteredAlpha\" serializeAs=\"String\">\r\n        <value>0</value>\r\n      </setting>\r\n    </DynamicFiltersUserSettings>\r\n    <LayoutUserSettings>\r\n      <setting name=\"Layout\" serializeAs=\"String\">\r\n        <value>Sugiyama</value>\r\n      </setting>\r\n      <setting name=\"LayoutStyle\" serializeAs=\"String\">\r\n        <value>UseGroups</value>\r\n      </setting>\r\n      <setting name=\"GroupRectanglePenWidth\" serializeAs=\"String\">\r\n        <value>1</value>\r\n      </setting>\r\n      <setting name=\"FruchtermanReingoldC\" serializeAs=\"String\">\r\n        <value>3</value>\r\n      </setting>\r\n      <setting name=\"IntergroupEdgeStyle\" serializeAs=\"String\">\r\n        <value>Show</value>\r\n      </setting>\r\n      <setting name=\"ImproveLayoutOfGroups\" serializeAs=\"String\">\r\n        <value>False</value>\r\n      </setting>\r\n      <setting name=\"Margin\" serializeAs=\"String\">\r\n        <value>8</value>\r\n      </setting>\r\n      <setting name=\"FruchtermanReingoldIterations\" serializeAs=\"String\">\r\n        <value>10</value>\r\n      </setting>\r\n    </LayoutUserSettings>\r\n    <AutoFillUserSettings3>\r\n      <setting name=\"VertexLabelSourceColumnName\" serializeAs=\"String\">\r\n        <value>Vertex</value>\r\n      </setting>\r\n      <setting name=\"EdgeAlphaSourceColumnName\" serializeAs=\"String\">\r\n        <value />\r\n      </setting>\r\n      <setting name=\"GroupLabelSourceColumnName\" serializeAs=\"String\">\r\n        <value>Group</value>\r\n      </setting>\r\n      <setting name=\"VertexRadiusSourceColumnName\" serializeAs=\"String\">\r\n        <value />\r\n      </setting>\r\n      <setting name=\"VertexYSourceColumnName\" serializeAs=\"String\">\r\n        <value />\r\n      </setting>\r\n      <setting name=\"VertexXSourceColumnName\" serializeAs=\"String\">\r\n        <value />\r\n      </setting>\r\n      <setting name=\"VertexLabelPositionSourceColumnName\" serializeAs=\"String\">\r\n        <value />\r\n      </setting>\r\n      <setting name=\"EdgeLabelSourceColumnName\" serializeAs=\"String\">\r\n        <value>CDRE</value>\r\n      </setting>\r\n      <setting name=\"VertexColorSourceColumnName\" serializeAs=\"String\">\r\n        <value>Type</value>\r\n      </setting>\r\n      <setting name=\"EdgeVisibilitySourceColumnName\" serializeAs=\"String\">\r\n        <value />\r\n      </setting>\r\n      <setting name=\"VertexLayoutOrderSourceColumnName\" serializeAs=\"String\">\r\n        <value />\r\n      </setting>\r\n      <setting name=\"VertexToolTipSourceColumnName\" serializeAs=\"String\">\r\n        <value />\r\n      </setting>\r\n      <setting name=\"VertexAlphaSourceColumnName\" serializeAs=\"String\">\r\n        <value />\r\n      </setting>\r\n      <setting name=\"GroupCollapsedSourceColumnName\" serializeAs=\"String\">\r\n        <value />\r\n      </setting>\r\n      <setting name=\"VertexPolarRSourceColumnName\" serializeAs=\"String\">\r\n        <value />\r\n      </setting>\r\n      <setting name=\"EdgeWidthSourceColumnName\" serializeAs=\"String\">\r\n        <value>N</value>\r\n      </setting>\r\n      <setting name=\"VertexShapeSourceColumnName\" serializeAs=\"String\">\r\n        <value />\r\n      </setting>\r\n      <setting name=\"EdgeStyleSourceColumnName\" serializeAs=\"String\">\r\n        <value />\r\n      </setting>\r\n      <setting name=\"EdgeColorSourceColumnName\" serializeAs=\"String\">\r\n        <value>S</value>\r\n      </setting>\r\n      <setting name=\"VertexPolarAngleSourceColumnName\" serializeAs=\"String\">\r\n        <value />\r\n      </setting>\r\n      <setting name=\"VertexLabelFillColorSourceColumnName\" serializeAs=\"String\">\r\n        <value />\r\n      </setting>\r\n      <setting name=\"VertexVisibilitySourceColumnName\" serializeAs=\"String\">\r\n        <value />\r\n      </setting>\r\n      <setting name=\"VertexVisibilityDetails\" serializeAs=\"String\">\r\n        <value>GreaterThan\t0\tShow if in an Edge\tSkip</value>\r\n      </setting>\r\n      <setting name=\"VertexYDetails\" serializeAs=\"String\">\r\n        <value>False\tFalse\t0\t0\t0\t9999\tFalse\tFalse</value>\r\n      </setting>\r\n      <setting name=\"VertexLayoutOrderDetails\" serializeAs=\"String\">\r\n        <value>False\tFalse\t0\t0\t1\t9999\tFalse\tFalse</value>\r\n      </setting>\r\n      <setting name=\"EdgeStyleDetails\" serializeAs=\"String\">\r\n        <value>GreaterThan\t0\tSolid\tDash</value>\r\n      </setting>\r\n      <setting name=\"VertexColorDetails\" serializeAs=\"String\">\r\n        <value>False\tFalse\t0\t10\t241, 137, 4\t46, 7, 195\tFalse\tFalse\tFalse</value>\r\n      </setting>\r\n      <setting name=\"EdgeAlphaDetails\" serializeAs=\"String\">\r\n        <value>False\tFalse\t0\t0\t10\t100\tFalse\tFalse</value>\r\n      </setting>\r\n      <setting name=\"VertexLabelPositionDetails\" serializeAs=\"String\">\r\n        <value>GreaterThan\t0\tBottom Center\tNowhere</value>\r\n      </setting>\r\n      <setting name=\"VertexPolarAngleDetails\" serializeAs=\"String\">\r\n        <value>False\tFalse\t0\t0\t0\t359\tFalse\tFalse</value>\r\n      </setting>\r\n      <setting name=\"VertexAlphaDetails\" serializeAs=\"String\">\r\n        <value>False\tFalse\t0\t100\t10\t100\tFalse\tFalse</value>\r\n      </setting>\r\n      <setting name=\"EdgeWidthDetails\" serializeAs=\"String\">\r\n        <value>True\tFalse\t0\t0\t1\t2\tFalse\tFalse</value>\r\n      </setting>\r\n      <setting name=\"GroupCollapsedDetails\" serializeAs=\"String\">\r\n        <value>GreaterThan\t0\tYes\tNo</value>\r\n      </setting>\r\n      <setting name=\"VertexRadiusDetails\" serializeAs=\"String\">\r\n        <value>False\tFalse\t1\t10\t1.5\t10\tFalse\tFalse</value>\r\n      </setting>\r\n      <setting name=\"VertexShapeDetails\" serializeAs=\"String\">\r\n        <value>GreaterThan\t0\tLabel\tDisk</value>\r\n      </setting>\r\n      <setting name=\"VertexXDetails\" serializeAs=\"String\">\r\n        <value>False\tFalse\t0\t0\t0\t9999\tFalse\tFalse</value>\r\n      </setting>\r\n      <setting name=\"EdgeColorDetails\" serializeAs=\"String\">\r\n        <value>True\tTrue\t0\t1\t64, 0, 64\t128, 255, 0\tFalse\tFalse\tTrue</value>\r\n      </setting>\r\n      <setting name=\"VertexLabelFillColorDetails\" serializeAs=\"String\">\r\n        <value>False\tFalse\t0\t10\t241, 137, 4\t46, 7, 195\tFalse\tFalse\tTrue</value>\r\n      </setting>\r\n      <settin"]
[null,4,null,"Solid Triangle","Solid Triangle",null,null,"Bottom Center",null,"Workbook Settings 3","g name=\"EdgeVisibilityDetails\" serializeAs=\"String\">\r\n        <value>GreaterThan\t0\tShow\tSkip</value>\r\n      </setting>\r\n      <setting name=\"VertexPolarRDetails\" serializeAs=\"String\">\r\n        <value>False\tFalse\t0\t0\t0\t1\tFalse\tFalse</value>\r\n      </setting>\r\n      <setting name=\"GroupLabelDetails\" serializeAs=\"String\">\r\n        <value>False</value>\r\n      </setting>\r\n    </AutoFillUserSettings3>\r\n    <GeneralUserSettings4>\r\n      <setting name=\"ReadEdgeLabels\" serializeAs=\"String\">\r\n        <value>True</value>\r\n      </setting>\r\n      <setting name=\"ShowGraphLegend\" serializeAs=\"String\">\r\n        <value>False</value>\r\n      </setting>\r\n      <setting name=\"ShowGraphAxes\" serializeAs=\"String\">\r\n        <value>False</value>\r\n      </setting>\r\n      <setting name=\"ReadVertexLabels\" serializeAs=\"String\">\r\n        <value>True</value>\r\n      </setting>\r\n      <setting name=\"ReadGroupLabels\" serializeAs=\"String\">\r\n        <value>True</value>\r\n      </setting>\r\n      <setting name=\"NewWorkbookGraphDirectedness\" serializeAs=\"String\">\r\n        <value>Directed</value>\r\n      </setting>\r\n      <setting name=\"BackColor\" serializeAs=\"String\">\r\n        <value>White</value>\r\n      </setting>\r\n      <setting name=\"BackgroundImageUri\" serializeAs=\"String\">\r\n        <value />\r\n      </setting>\r\n      <setting name=\"AutoReadWorkbook\" serializeAs=\"String\">\r\n        <value>True</value>\r\n      </setting>\r\n      <setting name=\"SelectedEdgeColor\" serializeAs=\"String\">\r\n        <value>Red</value>\r\n      </setting>\r\n      <setting name=\"VertexAlpha\" serializeAs=\"String\">\r\n        <value>100</value>\r\n      </setting>\r\n      <setting name=\"AxisFont\" serializeAs=\"String\">\r\n        <value>Microsoft Sans Serif, 8.25pt</value>\r\n      </setting>\r\n      <setting name=\"EdgeBezierDisplacementFactor\" serializeAs=\"String\">\r\n        <value>0.2</value>\r\n      </setting>\r\n      <setting name=\"VertexRadius\" serializeAs=\"String\">\r\n        <value>1.5</value>\r\n      </setting>\r\n      <setting name=\"VertexRelativeOuterGlowSize\" serializeAs=\"String\">\r\n        <value>3</value>\r\n      </setting>\r\n      <setting name=\"AutoSelect\" serializeAs=\"String\">\r\n        <value>True</value>\r\n      </setting>\r\n      <setting name=\"EdgeCurveStyle\" serializeAs=\"String\">\r\n        <value>Straight</value>\r\n      </setting>\r\n      <setting name=\"VertexEffect\" serializeAs=\"String\">\r\n        <value>None</value>\r\n      </setting>\r\n      <setting name=\"LabelUserSettings\" serializeAs=\"String\">\r\n        <value>Garamond, 9.75pt\tWhite\tBottomCenter\t2147483647\t2147483647\tBlack\tTrue\t200\tBlack\t86\tMiddleCenter</value>\r\n      </setting>\r\n      <setting name=\"EdgeBundlerStraightening\" serializeAs=\"String\">\r\n        <value>0.15</value>\r\n      </setting>\r\n      <setting name=\"EdgeAlpha\" serializeAs=\"String\">\r\n        <value>100</value>\r\n      </setting>\r\n      <setting name=\"SelectedVertexColor\" serializeAs=\"String\">\r\n        <value>Red</value>\r\n      </setting>\r\n      <setting name=\"VertexColor\" serializeAs=\"String\">\r\n        <value>Black</value>\r\n      </setting>\r\n      <setting name=\"EdgeWidth\" serializeAs=\"String\">\r\n        <value>1</value>\r\n      </setting>\r\n      <setting name=\"VertexShape\" serializeAs=\"String\">\r\n        <value>Disk</value>\r\n      </setting>\r\n      <setting name=\"RelativeArrowSize\" serializeAs=\"String\">\r\n        <value>3</value>\r\n      </setting>\r\n      <setting name=\"VertexImageSize\" serializeAs=\"String\">\r\n        <value>100</value>\r\n      </setting>\r\n      <setting name=\"EdgeColor\" serializeAs=\"String\">\r\n        <value>Gray</value>\r\n      </setting>\r\n    </GeneralUserSettings4>\r\n    <GraphZoomAndScaleUserSettings>\r\n      <setting name=\"GraphScale\" serializeAs=\"String\">\r\n        <value>0.5</value>\r\n      </setting>\r\n    </GraphZoomAndScaleUserSettings>\r\n  </userSettings>\r\n</configuration>"]
[null,5,null,"Label",1,null,null,"Bottom Right"]
[null,null,null,"Image",2,null,null,0]
[null,null,null,1,3,null,null,1]
[null,null,null,2,4,null,null,2]
[null,null,null,3,5,null,null,3]
[null,null,null,4,6,null,null,4]
[null,null,null,5,7,null,null,5]
[null,null,null,6,8,null,null,6]
[null,null,null,7,9,null,null,7]
[null,null,null,8,null,null,null,8]
[null,null,null,9,null,null,null,9]
[null,null,null,10]
[null,null,null,11]